program: Orca
programVersion: 5.0.2
elementType: O O O N C C C C C C C C C C C C C C C C C C C C C C C C H H H H H H H H H H H H H H H H H H H H H H H H H
charge: 0
multiplicity: 1
keywords: wb97x-d3
keywords: def2-TZVPP
keywords: def2/J RIJCOSX
keywords: DEFGRID2
keywords: scfconv7
keywords: smallprint printgap noloewdin
keywords: NOSOSCF
formula: C24H25NO3
InChI: InChI=1/C24H25NO3/c1-16(2)13-20-22(24(20,3)4)23(26)28-21(15-25)17-9-8-12-19(14-17)27-18-10-6-5-7-11-18/h5-14,20-22H,1-4H3
53 atoms
O  -0.379374 1.423596 0.157736
O  -1.146021 3.492728 0.535338
O  -0.028581 -3.503613 -0.747246
N  -1.741215 0.51685 3.090331
C  1.520858 4.279458 -0.979391
C  1.649399 4.49782 0.487094
C  1.158079 3.154174 -0.020671
C  0.443582 5.017291 -1.73614
C  2.768079 4.040912 -1.796528
C  2.960883 4.602945 1.17532
C  -0.234731 2.764401 0.250794
C  3.18883 4.233198 2.436727
C  2.142342 3.626914 3.320779
C  4.536235 4.407115 3.069288
C  -1.644244 0.885422 0.500027
C  -1.834321 -0.422265 -0.224939
C  -1.697932 0.68772 1.955144
C  -0.859338 -1.406351 -0.15375
C  -2.998724 -0.640966 -0.946141
C  -1.047295 -2.608834 -0.818813
C  -3.180103 -1.849912 -1.599689
C  -2.211678 -2.83776 -1.546002
C  -0.278852 -4.836112 -0.933756
C  -1.139459 -5.525555 -0.089608
C  0.391823 -5.492473 -1.952975
C  -1.322555 -6.88658 -0.273784
C  0.205759 -6.856911 -2.122118
C  -0.652423 -7.556924 -1.288095
H  0.853974 5.103305 0.915131
H  1.867418 2.335563 0.013862
H  -0.432926 5.228735 -1.12832
H  0.836901 5.97117 -2.092169
H  0.120363 4.448994 -2.610342
H  2.5300 3.487177 -2.70592
H  3.217297 4.989951 -2.096177
H  3.522884 3.47397 -1.252078
H  3.77698 5.045039 0.611193
H  2.036601 4.203981 4.242457
H  1.161393 3.568863 2.854469
H  2.428066 2.615938 3.622044
H  4.477161 5.065004 3.939827
H  4.927866 3.452223 3.428186
H  5.263463 4.830614 2.377628
H  -2.447945 1.577646 0.23292
H  0.050666 -1.252314 0.412273
H  -3.760474 0.126179 -1.000861
H  -4.083945 -2.023971 -2.167714
H  -2.361565 -3.77207 -2.070495
H  -1.652737 -5.003876 0.708307
H  1.059496 -4.937192 -2.598642
H  -1.987936 -7.427393 0.386051
H  0.732909 -7.372078 -2.914051
H  -0.795249 -8.620465 -1.423159
totalener: -1210.08265138 hartree
nucrepener: 2394.12409150 hartree
electener: -3604.20674288 hartree
oneelecener: -6399.35351123 hartree
twoeener: 2795.14676835 hartree
kineticenergy: 1204.77027318 hartree
xcener: -118.587791498363 hartree
chargesum: -0.0000000
charge: -0.273453 -0.375197 -0.294120 -0.005537 0.132303 -0.035150 -0.098592 -0.256408 -0.275315 -0.238518 0.330275 -0.000370 -0.224067 -0.211201 0.335358 0.045623 -0.268190 -0.192037 -0.146832 0.193899 -0.121512 -0.145792 0.199705 -0.143011 -0.179435 -0.120473 -0.107076 -0.127419 0.108763 0.085232 0.099935 0.085874 0.087691 0.092567 0.092677 0.085407 0.094266 0.089319 0.083142 0.090206 0.088415 0.085489 0.078003 0.110016 0.120751 0.113670 0.129106 0.133465 0.137623 0.126642 0.129560 0.127004 0.127719
qa: -0.2735 -0.3752 -0.2941 -0.0055 0.1323 -0.0351 -0.0986 -0.2564 -0.2753 -0.2385 0.3303 -0.0004 -0.2241 -0.2112 0.3354 0.0456 -0.2682 -0.1920 -0.1468 0.1939 -0.1215 -0.1458 0.1997 -0.1430 -0.1794 -0.1205 -0.1071 -0.1274 0.1088 0.0852 0.0999 0.0859 0.0877 0.0926 0.0927 0.0854 0.0943 0.0893 0.0831 0.0902 0.0884 0.0855 0.0780 0.1100 0.1208 0.1137 0.1291 0.1335 0.1376 0.1266 0.1296 0.1270 0.1277
va: 2.1437 2.1238 2.1079 3.1177 3.7349 3.8443 3.8218 3.8984 3.9137 3.8937 4.2131 3.7282 3.9449 3.9421 3.8012 3.7579 4.0150 4.0902 3.9828 3.8969 3.9895 3.9292 3.8398 3.9655 4.0274 3.9428 3.9387 3.9461 1.0238 1.0297 1.0186 1.0027 1.0018 1.0065 1.0006 1.0045 1.0100 1.0025 1.0199 1.0012 0.9988 0.9992 1.0095 1.0379 1.0326 1.0106 1.0020 1.0055 1.0020 1.0118 0.9995 0.9992 0.9998
dispcorr: -0.024356349 hartree
energy: -1210.107007728656
dipole: 20.32357 -19.85193 0.47164 23.68456 -24.33846 -0.65390 -0.44378 -1.12751 -1.57129
magnitude: 1.76607 au
magnitude: 4.48898 debye
