program: Orca
programVersion: 5.0.2
elementType: O O O N C C C C C C C C C C C C C C C C C C C C C C C C H H H H H H H H H H H H H H H H H H H H H H H H H
charge: 0
multiplicity: 1
keywords: wb97x-d3
keywords: def2-TZVPP
keywords: def2/J RIJCOSX
keywords: DEFGRID2
keywords: scfconv7
keywords: smallprint printgap noloewdin
keywords: NOSOSCF
formula: C24H25NO3
InChI: InChI=1/C24H25NO3/c1-16(2)13-20-22(24(20,3)4)23(26)28-21(15-25)17-9-8-12-19(14-17)27-18-10-6-5-7-11-18/h5-14,20-22H,1-4H3
53 atoms
O  -0.859863 1.771834 0.718946
O  0.299997 1.678659 -1.195753
O  -1.230648 -3.147252 -1.869692
N  -4.073499 2.315064 1.208229
C  2.770975 2.015308 0.702403
C  2.407044 3.356009 0.164649
C  1.332385 2.49844 0.806289
C  3.152181 0.91544 -0.257604
C  3.507276 1.937635 2.019074
C  2.849835 4.607512 0.832401
C  0.252611 1.940565 -0.023711
C  2.099556 5.690601 1.039097
C  0.669167 5.803331 0.609423
C  2.652505 6.89672 1.736255
C  -1.995876 1.210373 0.072152
C  -1.999773 -0.29213 0.20727
C  -3.157919 1.826678 0.716486
C  -1.615878 -1.067513 -0.875556
C  -2.319193 -0.891057 1.420452
C  -1.566409 -2.450612 -0.752436
C  -2.265092 -2.269268 1.531234
C  -1.893543 -3.058363 0.452953
C  -0.62565 -4.368196 -1.758467
C  -1.166875 -5.425295 -2.473212
C  0.526368 -4.540941 -1.001416
C  -0.546214 -6.665152 -2.43326
C  1.130216 -5.787572 -0.96129
C  0.598567 -6.853528 -1.674047
H  2.339227 3.399906 -0.920206
H  1.019609 2.795439 1.800471
H  2.905555 -0.065383 0.153094
H  2.665209 1.00554 -1.224812
H  4.230666 0.939446 -0.424225
H  3.205966 2.722221 2.712814
H  3.324483 0.976988 2.503114
H  4.584165 2.028917 1.863155
H  3.884721 4.63045 1.162706
H  0.526018 6.693413 -0.00758
H  0.324382 4.946567 0.036047
H  0.009804 5.917862 1.473594
H  2.066829 7.134579 2.627796
H  3.687867 6.755022 2.043483
H  2.609124 7.778272 1.092367
H  -2.01335 1.489009 -0.985779
H  -1.345453 -0.607555 -1.817466
H  -2.621669 -0.290133 2.268492
H  -2.526224 -2.743725 2.467589
H  -1.869282 -4.135397 0.553503
H  -2.061965 -5.269806 -3.060973
H  0.950309 -3.708577 -0.453879
H  -0.966092 -7.488374 -2.99621
H  2.029016 -5.922837 -0.374209
H  1.077855 -7.82244 -1.641503
totalener: -1210.08277831 hartree
nucrepener: 2435.29485829 hartree
electener: -3645.37763660 hartree
oneelecener: -6481.53698607 hartree
twoeener: 2836.15934946 hartree
kineticenergy: 1204.77206225 hartree
xcener: -118.589023479191 hartree
chargesum: -0.0000000
charge: -0.256590 -0.389676 -0.294534 -0.005548 0.120646 -0.010424 -0.142469 -0.259723 -0.268103 -0.240450 0.363957 -0.010954 -0.220892 -0.209071 0.312368 0.001070 -0.256091 -0.157777 -0.166333 0.203254 -0.121232 -0.146406 0.220610 -0.191013 -0.154078 -0.100908 -0.118113 -0.133920 0.108444 0.093363 0.085413 0.102629 0.085686 0.087926 0.092134 0.090426 0.094412 0.092513 0.081206 0.093779 0.085797 0.078733 0.088563 0.118895 0.121663 0.121580 0.130822 0.134679 0.127052 0.134555 0.127220 0.127793 0.127118
qa: -0.2566 -0.3897 -0.2945 -0.0055 0.1206 -0.0104 -0.1425 -0.2597 -0.2681 -0.2404 0.3640 -0.0110 -0.2209 -0.2091 0.3124 0.0011 -0.2561 -0.1578 -0.1663 0.2033 -0.1212 -0.1464 0.2206 -0.1910 -0.1541 -0.1009 -0.1181 -0.1339 0.1084 0.0934 0.0854 0.1026 0.0857 0.0879 0.0921 0.0904 0.0944 0.0925 0.0812 0.0938 0.0858 0.0787 0.0886 0.1189 0.1217 0.1216 0.1308 0.1347 0.1271 0.1346 0.1272 0.1278 0.1271
va: 2.1162 2.1106 2.1088 3.1193 3.7400 3.8122 3.8577 3.9068 3.9093 3.8881 4.1651 3.7495 3.9388 3.9414 3.8329 3.7013 4.0274 4.0251 4.0401 3.9026 3.9689 3.9345 3.8241 4.0332 3.9548 3.9374 3.9429 3.9537 1.0216 1.0299 1.0021 1.0202 1.0023 1.0052 1.0063 1.0018 1.0101 1.0018 1.0150 1.0014 0.9994 1.0096 0.9992 1.0231 1.0325 1.0162 1.0011 1.0041 1.0127 1.0021 0.9989 0.9998 0.9999
dispcorr: -0.025161570 hartree
energy: -1210.107939879380
dipole: 26.24419 -24.77791 1.46628 19.93732 -20.77772 -0.84040 8.93372 -8.60305 0.33067
magnitude: 1.72209 au
magnitude: 4.37722 debye
