program: Orca
programVersion: 5.0.2
elementType: O O O N C C C C C C C C C C C C C C C C C C C C C C C C H H H H H H H H H H H H H H H H H H H H H H H H H
charge: 0
multiplicity: 1
keywords: wb97x-d3
keywords: def2-TZVPP
keywords: def2/J RIJCOSX
keywords: DEFGRID2
keywords: scfconv7
keywords: smallprint printgap noloewdin
keywords: NOSOSCF
formula: C24H25NO3
InChI: InChI=1/C24H25NO3/c1-16(2)13-20-22(24(20,3)4)23(26)28-21(15-25)17-9-8-12-19(14-17)27-18-10-6-5-7-11-18/h5-14,20-22H,1-4H3
53 atoms
O  -0.193831 1.410301 0.922742
O  -0.2080 2.563788 -1.002761
O  -1.49113 -3.443008 -1.845144
N  -3.193669 1.373929 2.352069
C  2.745304 3.259979 -0.15146
C  1.838614 4.389575 0.188589
C  1.477911 2.985628 0.644131
C  2.860308 2.822901 -1.591103
C  4.029883 3.094184 0.625431
C  2.18989 5.426522 1.192437
C  0.295317 2.330822 0.062439
C  1.313622 6.05034 1.981485
C  -0.155832 5.759606 1.968435
C  1.749146 7.102354 2.955555
C  -1.38951 0.731028 0.570186
C  -1.151517 -0.757162 0.540116
C  -2.397138 1.090735 1.573889
C  -1.4053 -1.459128 -0.6242
C  -0.671467 -1.415594 1.66817
C  -1.191774 -2.834298 -0.6692
C  -0.459588 -2.779724 1.611042
C  -0.717893 -3.500873 0.452043
C  -1.123137 -4.749596 -2.035235
C  -2.100499 -5.730772 -2.009328
C  0.202784 -5.072085 -2.286774
C  -1.74436 -7.051431 -2.242558
C  0.548033 -6.395455 -2.511694
C  -0.421969 -7.387934 -2.48854
H  1.230451 4.736214 -0.643745
H  1.634889 2.771605 1.694695
H  3.65674 3.387656 -2.079148
H  3.118399 1.76458 -1.659869
H  1.946395 2.983507 -2.157229
H  4.822663 3.706995 0.191421
H  3.926322 3.379509 1.672188
H  4.362966 2.055673 0.596457
H  3.237082 5.706904 1.260071
H  -0.727867 6.676023 1.805586
H  -0.446715 5.04907 1.19825
H  -0.480949 5.359056 2.931995
H  2.826808 7.259913 2.935818
H  1.265218 8.05856 2.742563
H  1.466264 6.832149 3.975901
H  -1.750498 1.071865 -0.404513
H  -1.771505 -0.952917 -1.50914
H  -0.472448 -0.87063 2.581577
H  -0.092139 -3.303425 2.483387
H  -0.55319 -4.569666 0.436343
H  -3.129481 -5.457922 -1.815151
H  0.953837 -4.292795 -2.310133
H  -2.505961 -7.819664 -2.227094
H  1.580646 -6.650732 -2.709155
H  -0.147889 -8.418998 -2.666249
totalener: -1210.08231918 hartree
nucrepener: 2387.63522455 hartree
electener: -3597.71754374 hartree
oneelecener: -6386.28428747 hartree
twoeener: 2788.56674374 hartree
kineticenergy: 1204.76641016 hartree
xcener: -118.587238263070 hartree
chargesum: 0.0000000
charge: -0.269503 -0.382713 -0.293422 -0.005524 0.131978 -0.029953 -0.116789 -0.255674 -0.274688 -0.239329 0.344791 -0.002345 -0.223151 -0.209793 0.322313 0.029538 -0.258115 -0.165017 -0.188123 0.228027 -0.122638 -0.156837 0.187906 -0.152621 -0.144262 -0.119407 -0.124442 -0.117362 0.108119 0.086774 0.085396 0.086622 0.100916 0.092521 0.086001 0.092312 0.094098 0.089593 0.078073 0.094325 0.078423 0.088254 0.086064 0.116076 0.115766 0.122357 0.128978 0.129902 0.127974 0.132176 0.129013 0.128656 0.128765
qa: -0.2695 -0.3827 -0.2934 -0.0055 0.1320 -0.0300 -0.1168 -0.2557 -0.2747 -0.2393 0.3448 -0.0023 -0.2232 -0.2098 0.3223 0.0295 -0.2581 -0.1650 -0.1881 0.2280 -0.1226 -0.1568 0.1879 -0.1526 -0.1443 -0.1194 -0.1244 -0.1174 0.1081 0.0868 0.0854 0.0866 0.1009 0.0925 0.0860 0.0923 0.0941 0.0896 0.0781 0.0943 0.0784 0.0883 0.0861 0.1161 0.1158 0.1224 0.1290 0.1299 0.1280 0.1322 0.1290 0.1287 0.1288
va: 2.1226 2.1213 2.1108 3.1187 3.7349 3.8393 3.8096 3.9018 3.9142 3.8930 4.2067 3.7344 3.9447 3.9419 3.7898 3.7747 4.0391 4.0321 4.0474 3.9002 3.9801 3.9287 3.8505 4.0127 3.9844 3.9409 3.9447 3.9373 1.0231 1.0317 1.0021 1.0020 1.0194 1.0009 1.0044 1.0065 1.0101 1.0024 1.0188 1.0009 1.0094 0.9990 0.9991 1.0436 1.0240 1.0176 1.0011 1.0095 1.0095 1.0039 0.9993 0.9997 0.9995
dispcorr: -0.024367861 hartree
energy: -1210.106687042884
dipole: 22.35993 -20.78788 1.57206 26.26118 -27.22057 -0.95939 5.81812 -6.04684 -0.22873
magnitude: 1.85583 au
magnitude: 4.71714 debye
