program: Orca
programVersion: 5.0.2
elementType: O O O N C C C C C C C C C C C C C C C C C C C C C C C C H H H H H H H H H H H H H H H H H H H H H H H H H
charge: 0
multiplicity: 1
keywords: wb97x-d3
keywords: def2-TZVPP
keywords: def2/J RIJCOSX
keywords: DEFGRID2
keywords: scfconv7
keywords: smallprint printgap noloewdin
keywords: NOSOSCF
formula: C24H25NO3
InChI: InChI=1/C24H25NO3/c1-16(2)13-20-22(24(20,3)4)23(26)28-21(15-25)17-9-8-12-19(14-17)27-18-10-6-5-7-11-18/h5-14,20-22H,1-4H3
53 atoms
O  -0.881068 1.259745 -0.126915
O  -0.930959 3.241491 0.903533
O  -1.565913 -3.623231 -1.331445
N  -1.735764 0.367798 3.015835
C  1.458999 3.925508 -1.029814
C  2.005509 3.476865 0.280732
C  0.969272 2.619908 -0.424632
C  0.559456 5.136459 -1.07453
C  2.312196 3.76831 -2.266204
C  3.396247 2.977628 0.434958
C  -0.358276 2.464696 0.189772
C  3.761784 1.919414 1.160536
C  2.800787 1.062643 1.927155
C  5.199022 1.505698 1.260865
C  -2.110699 0.913936 0.481712
C  -2.653192 -0.309928 -0.212422
C  -1.894891 0.628628 1.908207
C  -1.815738 -1.396718 -0.433788
C  -3.980939 -0.350264 -0.602859
C  -2.322174 -2.532391 -1.047024
C  -4.475592 -1.49276 -1.218085
C  -3.656908 -2.583428 -1.439545
C  -0.402856 -3.847416 -0.64486
C  -0.393438 -3.956479 0.739791
C  0.761536 -4.013613 -1.376872
C  0.800028 -4.225032 1.390107
C  1.947361 -4.296578 -0.714623
C  1.972798 -4.396869 0.667803
H  1.606505 4.01575 1.137423
H  1.344659 1.723398 -0.903953
H  -0.140286 5.073189 -1.909896
H  -0.017297 5.269692 -0.163062
H  1.16361 6.033607 -1.220233
H  1.686582 3.692325 -3.156761
H  2.963962 4.634859 -2.394245
H  2.944768 2.881633 -2.226782
H  4.170322 3.548097 -0.070789
H  2.769409 0.04958 1.517241
H  3.122749 0.964218 2.966225
H  1.785524 1.450821 1.938441
H  5.544187 1.540466 2.296918
H  5.333793 0.475035 0.923301
H  5.853451 2.142618 0.667183
H  -2.829321 1.736404 0.41194
H  -0.777376 -1.351316 -0.131966
H  -4.629272 0.499264 -0.430807
H  -5.511896 -1.532888 -1.5252
H  -4.03733 -3.476608 -1.917127
H  -1.308288 -3.830165 1.304852
H  0.732599 -3.92771 -2.455094
H  0.809358 -4.305351 2.468847
H  2.856345 -4.432586 -1.285511
H  2.900148 -4.612298 1.181019
totalener: -1210.08205609 hartree
nucrepener: 2501.39669814 hartree
electener: -3711.47875423 hartree
oneelecener: -6613.87600809 hartree
twoeener: 2902.39725386 hartree
kineticenergy: 1204.77418166 hartree
xcener: -118.589567504062 hartree
chargesum: -0.0000000
charge: -0.273580 -0.365502 -0.295341 -0.009473 0.126092 -0.016135 -0.121774 -0.258636 -0.267763 -0.245492 0.321947 -0.004526 -0.218159 -0.211793 0.330102 0.039508 -0.255525 -0.173609 -0.167994 0.226614 -0.086066 -0.207020 0.240907 -0.173500 -0.193198 -0.108564 -0.099309 -0.142167 0.111314 0.090795 0.085378 0.102735 0.084582 0.092468 0.090954 0.086381 0.094270 0.088243 0.091804 0.088921 0.089168 0.084587 0.078040 0.109534 0.123973 0.111930 0.126937 0.127922 0.137354 0.125904 0.132383 0.126431 0.127949
qa: -0.2736 -0.3655 -0.2953 -0.0095 0.1261 -0.0161 -0.1218 -0.2586 -0.2678 -0.2455 0.3219 -0.0045 -0.2182 -0.2118 0.3301 0.0395 -0.2555 -0.1736 -0.1680 0.2266 -0.0861 -0.2070 0.2409 -0.1735 -0.1932 -0.1086 -0.0993 -0.1422 0.1113 0.0908 0.0854 0.1027 0.0846 0.0925 0.0910 0.0864 0.0943 0.0882 0.0918 0.0889 0.0892 0.0846 0.0780 0.1095 0.1240 0.1119 0.1269 0.1279 0.1374 0.1259 0.1324 0.1264 0.1279
va: 2.1341 2.1330 2.1187 3.1130 3.7322 3.8227 3.8529 3.9042 3.9091 3.8968 4.1985 3.7333 3.9424 3.9428 3.8461 3.7680 3.9738 3.9534 4.0041 3.8538 3.9663 4.0369 3.7973 3.9740 4.0410 3.9396 3.9301 3.9522 1.0220 1.0266 1.0022 1.0201 1.0025 1.0063 1.0019 1.0051 1.0107 1.0019 1.0035 1.0142 0.9991 0.9992 1.0096 1.0279 1.0283 1.0122 1.0002 1.0124 1.0025 1.0126 0.9989 0.9990 0.9999
dispcorr: -0.025731151 hartree
energy: -1210.107787241480
dipole: 26.72499 -26.09056 0.63443 17.05083 -17.31666 -0.26583 -3.14975 1.75839 -1.39136
magnitude: 1.55211 au
magnitude: 3.94515 debye
