program: Orca
programVersion: 5.0.2
elementType: O O O N C C C C C C C C C C C C C C C C C C C C C C C C H H H H H H H H H H H H H H H H H H H H H H H H H
charge: 0
multiplicity: 1
keywords: wb97x-d3
keywords: def2-TZVPP
keywords: def2/J RIJCOSX
keywords: DEFGRID2
keywords: scfconv7
keywords: smallprint printgap noloewdin
keywords: NOSOSCF
formula: C24H25NO3
InChI: InChI=1/C24H25NO3/c1-16(2)13-20-22(24(20,3)4)23(26)28-21(15-25)17-9-8-12-19(14-17)27-18-10-6-5-7-11-18/h5-14,20-22H,1-4H3
53 atoms
O  -0.408276 1.451503 0.084268
O  -1.099626 3.530954 0.533383
O  -0.03998 -3.453958 -0.744445
N  -2.107637 0.681527 2.897958
C  1.600092 4.237402 -0.967075
C  1.732598 4.448511 0.500907
C  1.19821 3.12467 -0.008078
C  0.549296 5.011019 -1.7250
C  2.840572 3.958196 -1.781185
C  3.052739 4.508609 1.179419
C  -0.211731 2.780004 0.235236
C  3.302096 4.050709 2.40707
C  2.26835 3.386383 3.263726
C  4.661985 4.173909 3.024543
C  -1.715535 0.964552 0.325054
C  -1.875256 -0.367253 -0.364284
C  -1.928735 0.820932 1.771821
C  -0.895163 -1.34116 -0.238674
C  -3.024919 -0.621437 -1.097179
C  -1.0626 -2.567474 -0.864067
C  -3.185208 -1.853963 -1.711418
C  -2.209991 -2.830578 -1.606348
C  -0.293291 -4.796627 -0.817268
C  0.449332 -5.550291 -1.712001
C  -1.22599 -5.400355 0.016475
C  0.260052 -6.923539 -1.767756
C  -1.412463 -6.771405 -0.056434
C  -0.672303 -7.537882 -0.945945
H  0.960768 5.082997 0.930568
H  1.87854 2.281655 0.025964
H  0.220791 4.461767 -2.60925
H  -0.327647 5.238084 -1.123349
H  0.96941 5.959054 -2.06541
H  3.579996 3.378651 -1.229004
H  2.588338 3.400578 -2.684351
H  3.314357 4.891756 -2.091331
H  3.858438 4.99189 0.6343
H  2.197261 3.882786 4.23423
H  1.275117 3.387702 2.821068
H  2.542898 2.348485 3.468649
H  5.379491 4.638864 2.349597
H  4.624298 4.7703 3.93937
H  5.052798 3.193896 3.309093
H  -2.46733 1.666858 -0.047489
H  0.003088 -1.160702 0.33767
H  -3.79231 0.136118 -1.191813
H  -4.076874 -2.054991 -2.289658
H  -2.340727 -3.783558 -2.101637
H  1.172403 -5.061578 -2.35167
H  -1.795066 -4.805847 0.719922
H  0.842004 -7.513281 -2.463448
H  -2.136448 -7.243595 0.594311
H  -0.819702 -8.608206 -0.99439
totalener: -1210.08249980 hartree
nucrepener: 2397.67102522 hartree
electener: -3607.75352502 hartree
oneelecener: -6406.41071691 hartree
twoeener: 2798.65719190 hartree
kineticenergy: 1204.77213188 hartree
xcener: -118.588619257859 hartree
chargesum: -0.0000000
charge: -0.273685 -0.370986 -0.295456 -0.005273 0.125959 -0.022874 -0.106978 -0.258609 -0.273363 -0.242364 0.328896 -0.002674 -0.223466 -0.210585 0.327401 0.049635 -0.263385 -0.184022 -0.150149 0.187762 -0.120318 -0.144982 0.211942 -0.189732 -0.150056 -0.101940 -0.118741 -0.132483 0.109820 0.087210 0.087527 0.100729 0.086891 0.086333 0.092714 0.092036 0.094335 0.090110 0.084635 0.089596 0.078426 0.088729 0.085234 0.109718 0.120214 0.113083 0.129052 0.134450 0.127060 0.138374 0.126682 0.129911 0.127655
qa: -0.2737 -0.3710 -0.2955 -0.0053 0.1260 -0.0229 -0.1070 -0.2586 -0.2734 -0.2424 0.3289 -0.0027 -0.2235 -0.2106 0.3274 0.0496 -0.2634 -0.1840 -0.1501 0.1878 -0.1203 -0.1450 0.2119 -0.1897 -0.1501 -0.1019 -0.1187 -0.1325 0.1098 0.0872 0.0875 0.1007 0.0869 0.0863 0.0927 0.0920 0.0943 0.0901 0.0846 0.0896 0.0784 0.0887 0.0852 0.1097 0.1202 0.1131 0.1291 0.1344 0.1271 0.1384 0.1267 0.1299 0.1277
va: 2.1419 2.1282 2.1086 3.1185 3.7388 3.8325 3.8334 3.9000 3.9117 3.8975 4.2070 3.7278 3.9431 3.9425 3.8180 3.7544 3.9967 4.0832 3.9952 3.9007 3.9860 3.9302 3.8279 4.0327 3.9567 3.9379 3.9432 3.9513 1.0238 1.0279 1.0017 1.0184 1.0028 1.0047 1.0064 1.0011 1.0099 1.0030 1.0189 1.0010 1.0095 0.9990 0.9992 1.0336 1.0337 1.0111 1.0020 1.0041 1.0123 1.0017 0.9992 0.9995 0.9999
dispcorr: -0.024404322 hartree
energy: -1210.106904121074
dipole: 21.57568 -20.96117 0.61451 22.27685 -22.96416 -0.68732 -0.08387 -1.46196 -1.54582
magnitude: 1.79989 au
magnitude: 4.57495 debye
