program: Orca
programVersion: 5.0.2
elementType: O O O N C C C C C C C C C C C C C C C C C C C C C C C C H H H H H H H H H H H H H H H H H H H H H H H H H
charge: 0
multiplicity: 1
keywords: wb97x-d3
keywords: def2-TZVPP
keywords: def2/J RIJCOSX
keywords: DEFGRID2
keywords: scfconv7
keywords: smallprint printgap noloewdin
keywords: NOSOSCF
formula: C24H25NO3
InChI: InChI=1/C24H25NO3/c1-16(2)13-20-22(24(20,3)4)23(26)28-21(15-25)17-9-8-12-19(14-17)27-18-10-6-5-7-11-18/h5-14,20-22H,1-4H3
53 atoms
O  -0.823494 1.35074 -0.266814
O  -0.947273 3.286307 0.840771
O  -1.431399 -3.658426 -1.286267
N  -1.619532 0.354798 2.865216
C  1.406097 4.183573 -1.017189
C  1.991209 3.615765 0.229584
C  0.956976 2.812118 -0.540886
C  0.486327 5.376371 -0.924083
C  2.239986 4.172067 -2.277692
C  3.401329 3.154622 0.29777
C  -0.350662 2.566707 0.087476
C  3.831825 2.010483 0.831761
C  2.934281 0.982913 1.450784
C  5.291368 1.668256 0.852097
C  -2.032433 0.939401 0.345883
C  -2.533421 -0.289551 -0.368758
C  -1.795612 0.634688 1.764934
C  -1.707295 -1.401037 -0.483753
C  -3.817476 -0.30888 -0.888222
C  -2.184557 -2.542271 -1.110545
C  -4.279644 -1.452446 -1.525234
C  -3.473377 -2.569722 -1.634279
C  -0.474515 -4.001521 -0.37105
C  0.745224 -4.442323 -0.861087
C  -0.719488 -3.972832 0.996206
C  1.725626 -4.860783 0.025903
C  0.274385 -4.380989 1.871374
C  1.498394 -4.826382 1.393253
H  1.600684 4.055615 1.144893
H  1.33985 1.975906 -1.113936
H  -0.232774 5.379699 -1.745245
H  -0.069507 5.414053 0.008696
H  1.073902 6.293063 -0.999865
H  2.875091 5.058864 -2.324833
H  2.887651 3.297859 -2.341289
H  1.59967 4.178291 -3.160989
H  4.141488 3.839993 -0.106472
H  2.976423 0.042723 0.89462
H  3.263623 0.753399 2.466646
H  1.894148 1.292282 1.509577
H  5.478218 0.720176 0.341737
H  5.900637 2.433627 0.373176
H  5.649757 1.544818 1.876793
H  -2.784283 1.733155 0.299192
H  -0.702665 -1.376554 -0.0799
H  -4.457405 0.559309 -0.7967
H  -5.281338 -1.474865 -1.932457
H  -3.829905 -3.467608 -2.121339
H  0.915762 -4.462548 -1.929422
H  -1.674212 -3.635292 1.378829
H  2.675144 -5.20974 -0.357914
H  0.084513 -4.353036 2.935964
H  2.267718 -5.147102 2.082251
totalener: -1210.08205109 hartree
nucrepener: 2487.45315323 hartree
electener: -3697.53520432 hartree
oneelecener: -6586.02260620 hartree
twoeener: 2888.48740189 hartree
kineticenergy: 1204.76783219 hartree
xcener: -118.588581096374 hartree
chargesum: 0.0000000
charge: -0.271162 -0.366463 -0.297273 -0.006810 0.124890 -0.009744 -0.140178 -0.258219 -0.266305 -0.242497 0.329480 -0.010213 -0.215550 -0.211208 0.342124 0.052843 -0.261918 -0.193289 -0.159661 0.218888 -0.091745 -0.202135 0.256610 -0.214366 -0.178541 -0.090174 -0.103559 -0.146884 0.110644 0.096185 0.084604 0.104099 0.083620 0.090314 0.087019 0.092593 0.093919 0.087575 0.093303 0.088797 0.084316 0.078647 0.089573 0.104605 0.129184 0.112505 0.127516 0.128976 0.125537 0.135544 0.125168 0.132172 0.126642
qa: -0.2712 -0.3665 -0.2973 -0.0068 0.1249 -0.0097 -0.1402 -0.2582 -0.2663 -0.2425 0.3295 -0.0102 -0.2156 -0.2112 0.3421 0.0528 -0.2619 -0.1933 -0.1597 0.2189 -0.0917 -0.2021 0.2566 -0.2144 -0.1785 -0.0902 -0.1036 -0.1469 0.1106 0.0962 0.0846 0.1041 0.0836 0.0903 0.0870 0.0926 0.0939 0.0876 0.0933 0.0888 0.0843 0.0786 0.0896 0.1046 0.1292 0.1125 0.1275 0.1290 0.1255 0.1355 0.1252 0.1322 0.1266
va: 2.1422 2.1310 2.1174 3.1117 3.7307 3.8143 3.8762 3.9042 3.9095 3.8905 4.1829 3.7517 3.9383 3.9409 3.8460 3.7253 3.9778 3.9778 3.9869 3.8596 3.9683 4.0396 3.7831 4.0446 3.9580 3.9272 3.9457 3.9622 1.0215 1.0255 1.0023 1.0207 1.0021 1.0025 1.0054 1.0061 1.0110 1.0015 1.0034 1.0124 0.9997 1.0097 0.9991 1.0279 1.0196 1.0118 1.0004 1.0117 1.0137 1.0034 0.9990 0.9990 1.0003
dispcorr: -0.025597397 hartree
energy: -1210.107648483265
dipole: 26.14877 -25.63378 0.51499 17.94637 -18.15285 -0.20648 -3.63438 2.27255 -1.36183
magnitude: 1.47052 au
magnitude: 3.73777 debye
