program: Orca
programVersion: 5.0.2
elementType: O O O N C C C C C C C C C C C C C C C C C C C C C C C C H H H H H H H H H H H H H H H H H H H H H H H H H
charge: 0
multiplicity: 1
keywords: wb97x-d3
keywords: def2-TZVPP
keywords: def2/J RIJCOSX
keywords: DEFGRID2
keywords: scfconv7
keywords: smallprint printgap noloewdin
keywords: NOSOSCF
formula: C24H25NO3
InChI: InChI=1/C24H25NO3/c1-16(2)13-20-22(24(20,3)4)23(26)28-21(15-25)17-9-8-12-19(14-17)27-18-10-6-5-7-11-18/h5-14,20-22H,1-4H3
53 atoms
O  -1.044267 1.562589 -0.157744
O  -1.401956 3.750758 0.104324
O  -1.348224 -3.471724 -0.037259
N  -3.368704 1.508842 2.304405
C  1.750142 2.21656 0.977005
C  1.776751 1.887351 -0.485974
C  0.837514 2.964907 0.02104
C  1.198807 1.185988 1.935092
C  2.871457 3.02866 1.582631
C  2.891514 2.254124 -1.378459
C  -0.633615 2.836492 0.003014
C  3.454884 1.479856 -2.309147
C  3.049428 0.068117 -2.608936
C  4.582527 1.990371 -3.15607
C  -2.43676 1.30723 -0.133482
C  -2.631037 -0.09729 -0.647103
C  -2.952249 1.438923 1.236211
C  -1.919336 -1.131901 -0.052818
C  -3.476144 -0.347178 -1.71453
C  -2.030585 -2.417803 -0.556721
C  -3.605787 -1.646374 -2.189813
C  -2.882267 -2.680212 -1.625711
C  -0.197657 -3.226492 0.665577
C  0.886259 -2.605075 0.057537
C  -0.129349 -3.636264 1.986318
C  2.042394 -2.387643 0.788678
C  1.038865 -3.423731 2.705287
C  2.122929 -2.794608 2.113736
H  1.285577 0.951978 -0.72553
H  1.135015 3.990427 -0.168218
H  2.020845 0.60849 2.361011
H  0.664233 1.658266 2.761295
H  0.528956 0.473747 1.460577
H  3.217642 3.83265 0.934649
H  2.547319 3.483104 2.519918
H  3.728741 2.389439 1.800379
H  3.282554 3.260937 -1.265992
H  2.754757 -0.03427 -3.65603
H  3.890408 -0.613261 -2.456667
H  2.221568 -0.290115 -2.000409
H  4.323615 1.955151 -4.217259
H  4.848782 3.017874 -2.911749
H  5.477051 1.374324 -3.034297
H  -2.977154 2.022048 -0.76185
H  -1.278203 -0.931741 0.796106
H  -4.027509 0.460242 -2.178849
H  -4.26575 -1.850956 -3.021847
H  -2.966167 -3.689888 -2.005213
H  0.82415 -2.294343 -0.978052
H  -0.984252 -4.11676 2.443428
H  2.885647 -1.898759 0.318186
H  1.094267 -3.744701 3.736903
H  3.028783 -2.625825 2.680114
totalener: -1210.07900407 hartree
nucrepener: 2587.76157811 hartree
electener: -3797.84058218 hartree
oneelecener: -6785.99235690 hartree
twoeener: 2988.15177472 hartree
kineticenergy: 1204.77221902 hartree
xcener: -118.590654112888 hartree
chargesum: -0.0000000
charge: -0.264844 -0.338317 -0.297589 0.002618 0.111869 0.100893 -0.112750 -0.251395 -0.253452 -0.203062 0.332540 -0.054953 -0.212738 -0.206117 0.259829 0.062709 -0.240624 -0.197065 -0.164249 0.209592 -0.084797 -0.198392 0.233838 -0.181463 -0.180792 -0.120747 -0.089190 -0.142893 0.074963 0.076421 0.084983 0.113719 0.039539 0.071708 0.098226 0.091069 0.074218 0.094841 0.088863 0.037208 0.085937 0.078236 0.084217 0.111371 0.147989 0.113482 0.127623 0.129020 0.142638 0.127718 0.128653 0.129515 0.129383
qa: -0.2648 -0.3383 -0.2976 0.0026 0.1119 0.1009 -0.1127 -0.2514 -0.2535 -0.2031 0.3325 -0.0550 -0.2127 -0.2061 0.2598 0.0627 -0.2406 -0.1971 -0.1642 0.2096 -0.0848 -0.1984 0.2338 -0.1815 -0.1808 -0.1207 -0.0892 -0.1429 0.0750 0.0764 0.0850 0.1137 0.0395 0.0717 0.0982 0.0911 0.0742 0.0948 0.0889 0.0372 0.0859 0.0782 0.0842 0.1114 0.1480 0.1135 0.1276 0.1290 0.1426 0.1277 0.1287 0.1295 0.1294
va: 2.1235 2.1697 2.1215 3.1135 3.6926 3.7230 3.9031 3.9469 3.9281 3.9046 4.2694 3.8346 3.9442 3.9379 3.9313 3.6993 3.9682 3.9482 3.9936 3.8874 3.9626 4.0416 3.8372 3.9394 4.0381 3.8887 3.9240 3.9461 1.0090 1.0347 1.0044 1.0068 1.0155 1.0113 1.0031 1.0030 1.0215 1.0033 0.9985 1.0234 0.9982 1.0118 0.9981 1.0266 0.9989 1.0107 0.9998 1.0119 0.9925 1.0120 0.9981 0.9979 0.9998
dispcorr: -0.029522373 hartree
energy: -1210.108526440332
dipole: 31.56810 -30.03227 1.53583 6.14224 -7.09623 -0.95399 -6.44697 5.26058 -1.18639
magnitude: 2.16249 au
magnitude: 5.49661 debye
