program: Orca
programVersion: 5.0.2
elementType: O O O N C C C C C C C C C C C C C C C C C C C C C C C C H H H H H H H H H H H H H H H H H H H H H H H H H
charge: 0
multiplicity: 1
keywords: wb97x-d3
keywords: def2-TZVPP
keywords: def2/J RIJCOSX
keywords: DEFGRID2
keywords: scfconv7
keywords: smallprint printgap noloewdin
keywords: NOSOSCF
formula: C24H25NO3
InChI: InChI=1/C24H25NO3/c1-16(2)13-20-22(24(20,3)4)23(26)28-21(15-25)17-9-8-12-19(14-17)27-18-10-6-5-7-11-18/h5-14,20-22H,1-4H3
53 atoms
O  -0.671771 1.502078 -0.020968
O  -1.222516 3.603197 0.498192
O  -0.546132 -3.532656 0.256793
N  -2.36551 1.177539 2.89549
C  1.492053 4.327011 -0.888662
C  1.714713 4.221007 0.579944
C  1.025821 3.081235 -0.150623
C  0.49444 5.331164 -1.41269
C  2.664653 4.114147 -1.816891
C  3.067543 4.022913 1.16173
C  -0.391473 2.813927 0.140825
C  3.372803 3.187649 2.156306
C  2.37432 2.302416 2.837876
C  4.774816 3.077329 2.67551
C  -1.98677 1.08836 0.306213
C  -2.164313 -0.330197 -0.171884
C  -2.19527 1.162786 1.759512
C  -1.260893 -1.308501 0.220799
C  -3.23206 -0.65299 -0.994696
C  -1.43628 -2.615473 -0.204647
C  -3.401513 -1.965883 -1.410634
C  -2.513736 -2.952216 -1.019676
C  -0.21919 -4.618148 -0.50647
C  -0.174429 -5.85318 0.121841
C  0.114749 -4.495409 -1.849608
C  0.209656 -6.973056 -0.600472
C  0.484149 -5.625023 -2.562437
C  0.533637 -6.866473 -1.944407
H  1.03325 4.820909 1.179218
H  1.624395 2.193768 -0.319394
H  0.999888 6.279857 -1.601898
H  0.062391 4.995645 -2.357219
H  -0.320034 5.521959 -0.71929
H  3.36513 3.367799 -1.442543
H  2.321348 3.786065 -2.799161
H  3.216837 5.045914 -1.955212
H  3.86067 4.638925 0.746681
H  2.414725 2.444675 3.920088
H  1.349101 2.483013 2.52459
H  2.602101 1.248483 2.658018
H  5.138198 2.049186 2.603961
H  5.467273 3.717762 2.130805
H  4.823284 3.350579 3.732297
H  -2.729183 1.739126 -0.166318
H  -0.423558 -1.069988 0.864599
H  -3.933199 0.110354 -1.306914
H  -4.2386 -2.226178 -2.044195
H  -2.662312 -3.974485 -1.341473
H  -0.433291 -5.928635 1.169701
H  0.09075 -3.527723 -2.334371
H  0.247697 -7.935405 -0.10759
H  0.743507 -5.529372 -3.608479
H  0.827216 -7.742916 -2.505786
totalener: -1210.08168281 hartree
nucrepener: 2418.60632332 hartree
electener: -3628.68800614 hartree
oneelecener: -6448.24422119 hartree
twoeener: 2819.55621505 hartree
kineticenergy: 1204.76541261 hartree
xcener: -118.587706665532 hartree
chargesum: -0.0000000
charge: -0.270611 -0.366509 -0.294111 -0.004412 0.125868 -0.012819 -0.128479 -0.260007 -0.267370 -0.243684 0.328121 -0.006660 -0.220886 -0.210884 0.335198 0.046391 -0.261167 -0.190755 -0.150245 0.194071 -0.115874 -0.153956 0.232322 -0.200256 -0.164015 -0.094610 -0.115768 -0.140001 0.111261 0.092019 0.084570 0.084616 0.104671 0.087042 0.091150 0.090873 0.093700 0.093311 0.089234 0.088092 0.084880 0.078389 0.089495 0.104970 0.119008 0.112981 0.129583 0.136250 0.128585 0.134155 0.126804 0.128102 0.127369
qa: -0.2706 -0.3665 -0.2941 -0.0044 0.1259 -0.0128 -0.1285 -0.2600 -0.2674 -0.2437 0.3281 -0.0067 -0.2209 -0.2109 0.3352 0.0464 -0.2612 -0.1908 -0.1502 0.1941 -0.1159 -0.1540 0.2323 -0.2003 -0.1640 -0.0946 -0.1158 -0.1400 0.1113 0.0920 0.0846 0.0846 0.1047 0.0870 0.0911 0.0909 0.0937 0.0933 0.0892 0.0881 0.0849 0.0784 0.0895 0.1050 0.1190 0.1130 0.1296 0.1363 0.1286 0.1342 0.1268 0.1281 0.1274
va: 2.1419 2.1294 2.1131 3.1122 3.7314 3.8185 3.8652 3.9039 3.9107 3.8937 4.1844 3.7398 3.9400 3.9421 3.8382 3.7381 3.9759 4.0953 3.9878 3.9078 3.9803 3.9420 3.8119 4.0359 3.9487 3.9353 3.9448 3.9585 1.0220 1.0265 1.0024 1.0021 1.0201 1.0054 1.0065 1.0020 1.0107 1.0032 1.0137 1.0010 0.9993 1.0095 0.9991 1.0260 1.0327 1.0117 1.0018 1.0026 1.0127 1.0026 0.9989 0.9998 1.0000
dispcorr: -0.024740261 hartree
energy: -1210.106423074483
dipole: 24.22089 -23.38719 0.83370 18.95599 -19.80273 -0.84674 -3.25567 1.46389 -1.79178
magnitude: 2.15000 au
magnitude: 5.46487 debye
