program: Orca
programVersion: 5.0.2
elementType: O O O N C C C C C C C C C C C C C C C C C C C C C C C C H H H H H H H H H H H H H H H H H H H H H H H H H
charge: 0
multiplicity: 1
keywords: wb97x-d3
keywords: def2-TZVPP
keywords: def2/J RIJCOSX
keywords: DEFGRID2
keywords: scfconv7
keywords: smallprint printgap noloewdin
keywords: NOSOSCF
formula: C24H25NO3
InChI: InChI=1/C24H25NO3/c1-16(2)13-20-22(24(20,3)4)23(26)28-21(15-25)17-9-8-12-19(14-17)27-18-10-6-5-7-11-18/h5-14,20-22H,1-4H3
53 atoms
O  -0.844093 0.777964 1.451557
O  -0.904845 2.428156 -0.05536
O  -1.929679 -3.308145 -1.542566
N  -3.065017 -0.584605 3.490803
C  2.071761 1.503082 -0.497085
C  2.041579 2.783263 0.283629
C  1.201563 1.612344 0.744361
C  1.44718 1.477134 -1.870481
C  3.274983 0.598832 -0.381829
C  3.176095 3.235236 1.112401
C  -0.266508 1.686745 0.639983
C  3.767274 4.426892 1.014585
C  3.331774 5.471859 0.02027
C  4.922796 4.793137 1.894714
C  -2.254184 0.655102 1.337979
C  -2.644881 -0.114631 0.098475
C  -2.690922 -0.039314 2.551723
C  -2.080102 -1.364454 -0.124028
C  -3.540665 0.427399 -0.807532
C  -2.41742 -2.069112 -1.269824
C  -3.884455 -0.296238 -1.940543
C  -3.324303 -1.537453 -2.180307
C  -0.693443 -3.666723 -1.079822
C  0.434256 -2.911102 -1.375889
C  -0.586517 -4.839909 -0.35063
C  1.674525 -3.343505 -0.935296
C  0.662285 -5.265338 0.078241
C  1.795061 -4.519195 -0.207759
H  1.467607 3.573234 -0.190512
H  1.561977 1.062425 1.606827
H  0.617001 2.170533 -1.977534
H  2.198579 1.738418 -2.617761
H  1.079386 0.476995 -2.111423
H  4.067371 0.933802 -1.05321
H  3.690618 0.567377 0.623991
H  3.010106 -0.423308 -0.658353
H  3.551262 2.536154 1.853577
H  2.274538 5.721901 0.124525
H  3.892718 6.397362 0.145733
H  3.483487 5.139228 -1.008095
H  4.696872 5.681243 2.490372
H  5.188788 3.98944 2.580278
H  5.807426 5.034445 1.299927
H  -2.731315 1.640475 1.324776
H  -1.386551 -1.78549 0.593911
H  -3.958335 1.411122 -0.639358
H  -4.582712 0.11977 -2.654071
H  -3.580918 -2.101462 -3.067185
H  0.34381 -1.998558 -1.95206
H  -1.476458 -5.41388 -0.128918
H  2.555134 -2.759947 -1.170465
H  0.745398 -6.182666 0.645643
H  2.766755 -4.852608 0.130201
totalener: -1210.08136917 hartree
nucrepener: 2517.49115576 hartree
electener: -3727.57252493 hartree
oneelecener: -6645.75659844 hartree
twoeener: 2918.18407351 hartree
kineticenergy: 1204.77391094 hartree
xcener: -118.589722989068 hartree
chargesum: -0.0000000
charge: -0.266081 -0.372514 -0.297455 -0.001633 0.089389 0.038457 -0.098480 -0.250758 -0.229291 -0.209003 0.321984 -0.013821 -0.280224 -0.211844 0.323980 0.032728 -0.261384 -0.173660 -0.143146 0.204158 -0.084877 -0.203415 0.205921 -0.158028 -0.177255 -0.124985 -0.100443 -0.135959 0.092936 0.078266 0.104458 0.088434 0.074694 0.094710 0.075191 0.070101 0.074650 0.098686 0.086020 0.103859 0.091104 0.073950 0.090923 0.119825 0.132647 0.108359 0.127002 0.128778 0.143185 0.128071 0.138429 0.127602 0.125759
qa: -0.2661 -0.3725 -0.2975 -0.0016 0.0894 0.0385 -0.0985 -0.2508 -0.2293 -0.2090 0.3220 -0.0138 -0.2802 -0.2118 0.3240 0.0327 -0.2614 -0.1737 -0.1431 0.2042 -0.0849 -0.2034 0.2059 -0.1580 -0.1773 -0.1250 -0.1004 -0.1360 0.0929 0.0783 0.1045 0.0884 0.0747 0.0947 0.0752 0.0701 0.0747 0.0987 0.0860 0.1039 0.0911 0.0739 0.0909 0.1198 0.1326 0.1084 0.1270 0.1288 0.1432 0.1281 0.1384 0.1276 0.1258
va: 2.1272 2.1321 2.1131 3.1225 3.7485 3.7982 3.9044 3.9085 3.9136 3.9128 4.2581 3.7423 3.9408 3.9328 3.8402 3.6620 4.0316 3.9322 4.0152 3.8568 3.9539 4.0373 3.8758 3.9642 4.0306 3.9509 3.9425 3.9776 1.0287 1.0378 1.0211 1.0026 1.0073 1.0052 1.0129 1.0196 1.0194 1.0005 1.0071 0.9947 0.9946 1.0140 0.9945 1.0201 1.0216 1.0156 0.9996 1.0115 0.9953 1.0122 0.9935 0.9989 1.0013
dispcorr: -0.026943426 hartree
energy: -1210.108312592172
dipole: 33.10188 -31.74808 1.35380 21.42769 -20.99512 0.43256 -5.54107 4.44875 -1.09231
magnitude: 1.79249 au
magnitude: 4.55615 debye
