program: Orca
programVersion: 5.0.2
elementType: O O O N C C C C C C C C C C C C C C C C C C C C C C C C H H H H H H H H H H H H H H H H H H H H H H H H H
charge: 0
multiplicity: 1
keywords: wb97x-d3
keywords: def2-TZVPP
keywords: def2/J RIJCOSX
keywords: DEFGRID2
keywords: scfconv7
keywords: smallprint printgap noloewdin
keywords: NOSOSCF
formula: C24H25NO3
InChI: InChI=1/C24H25NO3/c1-16(2)13-20-22(24(20,3)4)23(26)28-21(15-25)17-9-8-12-19(14-17)27-18-10-6-5-7-11-18/h5-14,20-22H,1-4H3
53 atoms
O  -1.028244 1.916119 -0.672166
O  0.729205 0.543206 -0.540651
O  -2.201158 -3.825591 0.099051
N  -3.894383 2.028503 -2.286581
C  1.38941 2.565398 1.824068
C  2.325397 2.777228 0.671567
C  0.837075 2.742203 0.415534
C  1.359802 1.21124 2.488727
C  1.123275 3.702743 2.778475
C  3.048122 4.05083 0.460058
C  0.230774 1.613857 -0.304202
C  4.374998 4.202613 0.419063
C  5.358281 3.087951 0.606966
C  4.98923 5.546764 0.167611
C  -1.780351 0.873358 -1.275818
C  -2.185901 -0.184654 -0.274781
C  -2.958147 1.537478 -1.83827
C  -1.989073 -1.521667 -0.582835
C  -2.73397 0.190678 0.946687
C  -2.332006 -2.492259 0.350914
C  -3.079854 -0.789691 1.862527
C  -2.873541 -2.130966 1.575743
C  -1.116042 -4.309327 -0.58036
C  -1.338388 -5.395011 -1.416132
C  0.164408 -3.796565 -0.408757
C  -0.269243 -5.973329 -2.084239
C  1.221916 -4.379084 -1.093046
C  1.013664 -5.465744 -1.931612
H  2.851759 1.880407 0.361121
H  0.352858 3.696622 0.238025
H  1.660913 0.399875 1.829002
H  2.045335 1.207159 3.338602
H  0.362938 0.981989 2.872151
H  1.911215 3.759499 3.532587
H  1.071848 4.670497 2.280784
H  0.176838 3.550589 3.301075
H  2.431601 4.934453 0.321085
H  4.901726 2.147173 0.909226
H  5.920735 2.90592 -0.312948
H  6.095105 3.354937 1.368758
H  4.239034 6.319988 0.001592
H  5.613579 5.858009 1.009521
H  5.644327 5.521072 -0.707508
H  -1.23296 0.421048 -2.109512
H  -1.566615 -1.798021 -1.54158
H  -2.892236 1.234587 1.187053
H  -3.506534 -0.509295 2.816466
H  -3.134556 -2.895579 2.296434
H  -2.341285 -5.785431 -1.536677
H  0.34604 -2.955705 0.249066
H  -0.445636 -6.820893 -2.733882
H  2.218823 -3.978648 -0.960974
H  1.844819 -5.914035 -2.459761
elementType: O N C H
totalener: -1210.10696660 hartree
nucrepener: 2460.49723439 hartree
electener: -3670.60420099 hartree
oneelecener: -6532.29265362 hartree
twoeener: 2861.68845263 hartree
cpcmener: -0.03043692 hartree
kineticenergy: 1204.71272318 hartree
xcener: -118.583615894569 hartree
chargesum: 0.0000000
charge: -0.277446 -0.443510 -0.327175 -0.087708 0.129476 0.035025 -0.113719 -0.278247 -0.262665 -0.285138 0.369880 -0.029608 -0.255963 -0.223678 0.399283 0.030684 -0.226327 -0.194587 -0.237563 0.275346 -0.123346 -0.218999 0.293241 -0.255835 -0.195582 -0.117442 -0.144884 -0.187876 0.096128 0.092546 0.093899 0.099244 0.095177 0.097528 0.088863 0.097796 0.118268 0.090202 0.099002 0.093341 0.088371 0.094100 0.093352 0.140277 0.145372 0.146691 0.158874 0.148650 0.145760 0.156415 0.157734 0.159403 0.157373
qa: -0.2774 -0.4435 -0.3272 -0.0877 0.1295 0.0350 -0.1137 -0.2782 -0.2627 -0.2851 0.3699 -0.0296 -0.2560 -0.2237 0.3993 0.0307 -0.2263 -0.1946 -0.2376 0.2753 -0.1233 -0.2190 0.2932 -0.2558 -0.1956 -0.1174 -0.1449 -0.1879 0.0961 0.0925 0.0939 0.0992 0.0952 0.0975 0.0889 0.0978 0.1183 0.0902 0.0990 0.0933 0.0884 0.0941 0.0934 0.1403 0.1454 0.1467 0.1589 0.1486 0.1458 0.1564 0.1577 0.1594 0.1574
va: 2.1227 2.0667 2.0839 3.1128 3.6898 3.7766 3.8685 3.9059 3.9027 3.8842 4.2101 3.7288 3.9456 3.9253 3.7361 3.5799 4.0794 3.9569 3.9619 3.7354 3.9042 4.0086 3.6886 4.0095 3.9044 3.8818 3.8956 3.9093 1.0279 1.0376 1.0146 1.0018 1.0012 1.0026 1.0042 1.0028 1.0093 1.0079 0.9964 0.9980 1.0088 0.9968 0.9952 1.0183 1.0058 1.0124 0.9893 1.0046 1.0085 0.9985 0.9890 0.9903 0.9906
dispcorr: -0.025546123 hartree
energy: -1210.132512720227
dipole: 32.51754 -30.70615 1.81139 20.75166 -20.65496 0.09670 14.60988 -13.37719 1.23269
magnitude: 2.19317 au
magnitude: 5.57460 debye
