program: Orca
programVersion: 5.0.2
elementType: O O O N C C C C C C C C C C C C C C C C C C C C C C C C H H H H H H H H H H H H H H H H H H H H H H H H H
charge: 0
multiplicity: 1
keywords: wb97x-d3
keywords: def2-TZVPP
keywords: def2/J RIJCOSX
keywords: DEFGRID2
keywords: scfconv7
keywords: smallprint printgap noloewdin
keywords: NOSOSCF
formula: C24H25NO3
InChI: InChI=1/C24H25NO3/c1-16(2)13-20-22(24(20,3)4)23(26)28-21(15-25)17-9-8-12-19(14-17)27-18-10-6-5-7-11-18/h5-14,20-22H,1-4H3
53 atoms
O  -1.033599 1.535712 -1.14798
O  -1.203806 2.040198 1.018342
O  -0.856376 -3.20607 0.758825
N  -4.012382 3.031186 -0.567885
C  1.365074 3.760632 0.44413
C  1.804632 2.460412 1.016162
C  0.846208 2.459885 -0.163216
C  0.455957 4.650225 1.25519
C  2.315746 4.531339 -0.440232
C  3.188621 1.950829 0.828877
C  -0.537697 2.012842 0.015691
C  3.515707 0.671257 0.632845
C  2.511689 -0.437635 0.574256
C  4.940803 0.250376 0.44337
C  -2.369795 1.081295 -1.156192
C  -2.614378 -0.184703 -0.356366
C  -3.281307 2.171943 -0.782224
C  -1.574568 -1.090366 -0.178054
C  -3.888493 -0.477926 0.110865
C  -1.82336 -2.289751 0.47756
C  -4.117946 -1.677925 0.76738
C  -3.094281 -2.589278 0.951468
C  0.232674 -3.417577 -0.038404
C  0.192204 -3.332664 -1.424912
C  1.395787 -3.811197 0.611051
C  1.337317 -3.624531 -2.153623
C  2.527227 -4.112337 -0.131363
C  2.507882 -4.012174 -1.515881
H  1.33051 2.200086 1.9603
H  1.278151 2.201765 -1.123323
H  1.05999 5.357573 1.827105
H  -0.206431 5.232491 0.611493
H  -0.159745 4.104018 1.9660
H  1.763688 5.200952 -1.102385
H  2.988053 5.14643 0.16152
H  2.929284 3.883042 -1.065609
H  3.985317 2.689166 0.866561
H  2.478695 -0.878853 -0.426303
H  2.796117 -1.242558 1.255391
H  1.5029 -0.12394 0.838181
H  5.253018 -0.447184 1.225137
H  5.068244 -0.275947 -0.506483
H  5.62747 1.096907 0.453381
H  -2.574562 0.867357 -2.209558
H  -0.579088 -0.864783 -0.539076
H  -4.707557 0.21663 -0.026652
H  -5.108923 -1.905388 1.137433
H  -3.270978 -3.524937 1.466664
H  -0.716136 -3.051169 -1.942083
H  1.410242 -3.882353 1.691733
H  1.305314 -3.554952 -3.233318
H  3.43073 -4.418786 0.380163
H  3.39421 -4.240788 -2.09299
elementType: O N C H
totalener: -1210.10296977 hartree
nucrepener: 2577.75794151 hartree
electener: -3787.86091129 hartree
oneelecener: -6766.92677678 hartree
twoeener: 2979.06586549 hartree
cpcmener: -0.03182984 hartree
kineticenergy: 1204.70582137 hartree
xcener: -118.588986793542 hartree
chargesum: -0.0000000
charge: -0.294116 -0.438360 -0.321723 -0.085356 0.151876 -0.007324 -0.121262 -0.280838 -0.285820 -0.286750 0.383167 0.003812 -0.262378 -0.233950 0.493914 -0.019798 -0.252996 -0.299521 -0.229872 0.369896 -0.092782 -0.265302 0.337828 -0.235728 -0.277119 -0.127810 -0.114003 -0.192284 0.109451 0.094023 0.095616 0.099765 0.094705 0.098101 0.099326 0.094043 0.121596 0.096116 0.107131 0.084666 0.097006 0.093473 0.090908 0.149032 0.142583 0.134776 0.158852 0.145031 0.159085 0.144979 0.159634 0.157054 0.157643
qa: -0.2941 -0.4384 -0.3217 -0.0854 0.1519 -0.0073 -0.1213 -0.2808 -0.2858 -0.2867 0.3832 0.0038 -0.2624 -0.2339 0.4939 -0.0198 -0.2530 -0.2995 -0.2299 0.3699 -0.0928 -0.2653 0.3378 -0.2357 -0.2771 -0.1278 -0.1140 -0.1923 0.1095 0.0940 0.0956 0.0998 0.0947 0.0981 0.0993 0.0940 0.1216 0.0961 0.1071 0.0847 0.0970 0.0935 0.0909 0.1490 0.1426 0.1348 0.1589 0.1450 0.1591 0.1450 0.1596 0.1571 0.1576
va: 2.1187 2.0671 2.0969 3.1036 3.7069 3.8118 3.8314 3.8944 3.9061 3.8874 4.1357 3.7297 3.9507 3.9295 3.7807 3.8023 4.1023 4.0002 3.9798 3.6457 3.8986 4.0278 3.6159 3.9170 3.9483 3.8733 3.8412 3.9003 1.0212 1.0339 1.0010 0.9998 1.0185 1.0031 1.0000 1.0019 1.0021 0.9954 0.9968 1.0055 0.9967 0.9969 1.0066 0.9859 1.0084 1.0158 0.9898 1.0082 0.9955 1.0111 0.9898 0.9898 0.9910
dispcorr: -0.029362609 hartree
energy: -1210.132332382261
dipole: 28.65709 -26.63484 2.02225 9.35864 -10.70847 -1.34983 1.40982 -2.79026 -1.38044
magnitude: 2.79591 au
magnitude: 7.10665 debye
