program: Orca
programVersion: 5.0.2
elementType: O O O N C C C C C C C C C C C C C C C C C C C C C C C C H H H H H H H H H H H H H H H H H H H H H H H H H
charge: 0
multiplicity: 1
keywords: wb97x-d3
keywords: def2-TZVPP
keywords: def2/J RIJCOSX
keywords: DEFGRID2
keywords: scfconv7
keywords: smallprint printgap noloewdin
keywords: NOSOSCF
formula: C24H25NO3
InChI: InChI=1/C24H25NO3/c1-16(2)13-20-22(24(20,3)4)23(26)28-21(15-25)17-9-8-12-19(14-17)27-18-10-6-5-7-11-18/h5-14,20-22H,1-4H3
53 atoms
O  -1.342896 1.860947 1.04601
O  -0.532585 2.033964 -1.028465
O  -1.255227 -3.14205 0.592889
N  -4.315223 1.674009 2.474866
C  2.099225 1.270904 0.607446
C  2.159052 2.676201 0.087689
C  0.937282 2.223668 0.857644
C  1.960161 0.144501 -0.387179
C  2.901081 0.881752 1.825552
C  3.031072 3.713308 0.674635
C  -0.343769 2.045622 0.160701
C  3.793695 4.584082 0.005185
C  3.90537 4.658022 -1.487514
C  4.615173 5.602217 0.738165
C  -2.608854 1.526638 0.502334
C  -2.635536 0.136622 -0.093162
C  -3.547019 1.61285 1.623788
C  -1.923611 -0.890685 0.514015
C  -3.362251 -0.099407 -1.249521
C  -1.940978 -2.153618 -0.053987
C  -3.384213 -1.375149 -1.796049
C  -2.675347 -2.408594 -1.206635
C  -0.404947 -3.950893 -0.110006
C  -0.272792 -5.258082 0.339047
C  0.341362 -3.493775 -1.190162
C  0.615703 -6.112236 -0.296708
C  1.220357 -4.363731 -1.820769
C  1.362652 -5.67271 -1.381495
H  1.996801 2.750866 -0.982199
H  0.847543 2.564844 1.883353
H  1.441409 0.432974 -1.299596
H  2.950925 -0.210722 -0.677927
H  1.42762 -0.701631 0.052803
H  2.479702 -0.013526 2.286936
H  3.932741 0.655292 1.548126
H  2.925641 1.659777 2.587499
H  3.036062 3.773433 1.759209
H  3.426195 3.831995 -2.009639
H  3.464332 5.586525 -1.861585
H  4.954952 4.673593 -1.792017
H  5.680908 5.46755 0.533859
H  4.365882 6.616057 0.412906
H  4.471083 5.551775 1.817597
H  -2.926223 2.2599 -0.247109
H  -1.348933 -0.723413 1.41728
H  -3.905868 0.707315 -1.724683
H  -3.955559 -1.56553 -2.694796
H  -2.69574 -3.400595 -1.640302
H  -0.858762 -5.599831 1.18316
H  0.251067 -2.472621 -1.539725
H  0.716417 -7.130531 0.056205
H  1.800789 -4.007169 -2.661992
H  2.050394 -6.34352 -1.879178
elementType: O N C H
totalener: -1210.10684308 hartree
nucrepener: 2486.91581425 hartree
electener: -3697.02265733 hartree
oneelecener: -6585.01890081 hartree
twoeener: 2887.99624348 hartree
cpcmener: -0.03125182 hartree
kineticenergy: 1204.70796698 hartree
xcener: -118.583619853395 hartree
chargesum: -0.0000000
charge: -0.282967 -0.436209 -0.329471 -0.087520 0.119070 0.041850 -0.084113 -0.281550 -0.272364 -0.281754 0.354994 -0.042383 -0.254696 -0.218782 0.407011 0.028513 -0.228835 -0.244010 -0.190786 0.229263 -0.128452 -0.158356 0.299573 -0.245393 -0.196220 -0.124938 -0.168612 -0.181492 0.091834 0.092807 0.098050 0.104147 0.089266 0.098324 0.099127 0.089432 0.116940 0.090906 0.099198 0.092838 0.094001 0.092159 0.087669 0.142975 0.138177 0.143854 0.160561 0.159568 0.145860 0.156678 0.157449 0.158685 0.158123
qa: -0.2830 -0.4362 -0.3295 -0.0875 0.1191 0.0418 -0.0841 -0.2815 -0.2724 -0.2818 0.3550 -0.0424 -0.2547 -0.2188 0.4070 0.0285 -0.2288 -0.2440 -0.1908 0.2293 -0.1285 -0.1584 0.2996 -0.2454 -0.1962 -0.1249 -0.1686 -0.1815 0.0918 0.0928 0.0980 0.1041 0.0893 0.0983 0.0991 0.0894 0.1169 0.0909 0.0992 0.0928 0.0940 0.0922 0.0877 0.1430 0.1382 0.1439 0.1606 0.1596 0.1459 0.1567 0.1574 0.1587 0.1581
va: 2.1140 2.0727 2.0657 3.1130 3.6988 3.7988 3.8202 3.9038 3.9061 3.8862 4.2301 3.7587 3.9420 3.9229 3.7204 3.6033 4.0782 4.0145 3.9892 3.7898 3.8966 3.9233 3.6620 4.0034 3.8726 3.8935 3.9286 3.9027 1.0323 1.0349 1.0145 1.0024 0.9995 1.0022 1.0017 1.0059 1.0112 1.0091 0.9959 0.9980 0.9964 0.9958 1.0091 1.0158 1.0260 1.0026 0.9900 0.9933 1.0084 0.9951 0.9892 0.9914 0.9901
dispcorr: -0.026537012 hartree
energy: -1210.133380091963
dipole: 34.42199 -32.64643 1.77557 13.90280 -14.25634 -0.35354 -5.18836 3.86055 -1.32781
magnitude: 2.24515 au
magnitude: 5.70673 debye
