program: Orca
programVersion: 5.0.2
elementType: O O O N C C C C C C C C C C C C C C C C C C C C C C C C H H H H H H H H H H H H H H H H H H H H H H H H H
charge: 0
multiplicity: 1
keywords: wb97x-d3
keywords: def2-TZVPP
keywords: def2/J RIJCOSX
keywords: DEFGRID2
keywords: scfconv7
keywords: smallprint printgap noloewdin
keywords: NOSOSCF
formula: C24H25NO3
InChI: InChI=1/C24H25NO3/c1-16(2)13-20-22(24(20,3)4)23(26)28-21(15-25)17-9-8-12-19(14-17)27-18-10-6-5-7-11-18/h5-14,20-22H,1-4H3
53 atoms
O  -0.888601 1.550444 0.209568
O  -0.905662 0.228603 2.002419
O  -1.727113 -2.956297 -1.867512
N  -3.417305 2.550074 2.235911
C  2.108102 0.834643 -0.0161
C  1.912951 2.180083 0.611539
C  1.188463 0.979455 1.190159
C  1.574345 0.580985 -1.403439
C  3.40273 0.104677 0.248903
C  2.965706 2.833981 1.425594
C  -0.277028 0.858134 1.189736
C  3.677438 3.904195 1.060501
C  3.527722 4.601499 -0.256306
C  4.710216 4.491587 1.974127
C  -2.298005 1.478406 0.128047
C  -2.83095 0.093229 -0.185919
C  -2.908935 2.053786 1.333544
C  -2.028256 -0.785954 -0.896234
C  -4.120959 -0.277576 0.172229
C  -2.497837 -2.05804 -1.188058
C  -4.591944 -1.536726 -0.169022
C  -3.781681 -2.442615 -0.834579
C  -0.40324 -3.094722 -1.545959
C  0.060906 -3.00726 -0.237587
C  0.466741 -3.385608 -2.587317
C  1.408845 -3.215873 0.016146
C  1.810703 -3.599242 -2.315815
C  2.289301 -3.512531 -1.01611
H  1.285486 2.852348 0.035228
H  1.602648 0.579118 2.10936
H  1.324565 -0.473383 -1.54244
H  0.69881 1.176933 -1.650696
H  2.346338 0.828019 -2.13547
H  3.282246 -0.96619 0.079232
H  4.180592 0.461523 -0.42957
H  3.766041 0.241443 1.266639
H  3.167088 2.394688 2.398575
H  4.481545 4.616035 -0.789974
H  2.792749 4.139267 -0.913113
H  3.240172 5.646582 -0.114071
H  5.696778 4.492693 1.502993
H  4.480236 5.534396 2.209068
H  4.787542 3.945224 2.914204
H  -2.553919 2.15262 -0.694537
H  -1.034529 -0.500662 -1.215804
H  -4.76532 0.40008 0.717899
H  -5.596922 -1.82401 0.110044
H  -4.138216 -3.436169 -1.074536
H  -0.61154 -2.783552 0.581176
H  0.091248 -3.450472 -3.600956
H  1.768694 -3.148696 1.034871
H  2.48581 -3.828705 -3.130124
H  3.338441 -3.676056 -0.80775
elementType: O N C H
totalener: -1210.10186035 hartree
nucrepener: 2590.32609103 hartree
electener: -3800.42795138 hartree
oneelecener: -6791.77168177 hartree
twoeener: 2991.34373038 hartree
cpcmener: -0.03287067 hartree
kineticenergy: 1204.71342707 hartree
xcener: -118.591701550271 hartree
chargesum: 0.0000000
charge: -0.284589 -0.430408 -0.328396 -0.081675 0.162513 0.027288 -0.121246 -0.285794 -0.271234 -0.302478 0.394078 -0.023290 -0.253076 -0.227418 0.447757 -0.022009 -0.240705 -0.232093 -0.203248 0.249100 -0.111429 -0.232623 0.276002 -0.173378 -0.229226 -0.172042 -0.115867 -0.188197 0.106493 0.090312 0.054707 0.100077 0.110133 0.092068 0.098120 0.094379 0.120620 0.095756 0.087340 0.097746 0.093489 0.094279 0.088889 0.143514 0.190110 0.134197 0.158539 0.147420 0.152115 0.144031 0.162800 0.157605 0.158948
qa: -0.2846 -0.4304 -0.3284 -0.0817 0.1625 0.0273 -0.1212 -0.2858 -0.2712 -0.3025 0.3941 -0.0233 -0.2531 -0.2274 0.4478 -0.0220 -0.2407 -0.2321 -0.2032 0.2491 -0.1114 -0.2326 0.2760 -0.1734 -0.2292 -0.1720 -0.1159 -0.1882 0.1065 0.0903 0.0547 0.1001 0.1101 0.0921 0.0981 0.0944 0.1206 0.0958 0.0873 0.0977 0.0935 0.0943 0.0889 0.1435 0.1901 0.1342 0.1585 0.1474 0.1521 0.1440 0.1628 0.1576 0.1589
va: 2.1250 2.0668 2.0896 3.1036 3.6138 3.7806 3.9532 3.8942 3.9047 3.8748 4.1634 3.7136 3.9468 3.9274 3.8288 3.7533 4.0999 3.9438 3.9665 3.7802 3.9084 4.0177 3.6881 3.8377 3.9795 3.8432 3.8760 3.8593 1.0200 1.0349 1.0197 1.0105 1.0052 1.0134 1.0043 1.0046 1.0084 0.9976 1.0087 0.9976 0.9965 0.9955 1.0083 0.9907 0.9680 1.0142 0.9896 1.0050 1.0042 1.0085 0.9895 0.9888 0.9902
dispcorr: -0.030649215 hartree
energy: -1210.132509566416
dipole: 34.02292 -32.17941 1.84352 13.83704 -13.74652 0.09051 -2.55298 0.45432 -2.09866
magnitude: 2.79484 au
magnitude: 7.10392 debye
