program: Orca
programVersion: 5.0.2
elementType: O O O N C C C C C C C C C C C C C C C C C C C C C C C C H H H H H H H H H H H H H H H H H H H H H H H H H
charge: 0
multiplicity: 1
keywords: wb97x-d3
keywords: def2-TZVPP
keywords: def2/J RIJCOSX
keywords: DEFGRID2
keywords: scfconv7
keywords: smallprint printgap noloewdin
keywords: NOSOSCF
formula: C24H25NO3
InChI: InChI=1/C24H25NO3/c1-16(2)13-20-22(24(20,3)4)23(26)28-21(15-25)17-9-8-12-19(14-17)27-18-10-6-5-7-11-18/h5-14,20-22H,1-4H3
53 atoms
O  -0.796754 1.869003 -0.539607
O  0.913179 0.466511 -0.218372
O  -2.051455 -3.850235 0.240646
N  -3.524658 1.99564 -2.373902
C  1.461173 2.562442 2.117081
C  2.465827 2.705435 1.026479
C  0.994181 2.693469 0.670274
C  1.34144 1.240641 2.834524
C  1.147389 3.748377 2.995852
C  3.257416 3.947849 0.826565
C  0.419585 1.553777 -0.054223
C  3.631391 4.426951 -0.362534
C  3.274454 3.772501 -1.661715
C  4.437502 5.683632 -0.483284
C  -1.511129 0.82648 -1.188502
C  -2.00649 -0.215896 -0.212163
C  -2.636699 1.494318 -1.846019
C  -1.781464 -1.557855 -0.478284
C  -2.663026 0.18122 0.94656
C  -2.201926 -2.511712 0.440694
C  -3.087697 -0.783012 1.846447
C  -2.85305 -2.127675 1.605026
C  -0.969499 -4.364209 -0.420655
C  -1.200631 -5.489932 -1.199633
C  0.314092 -3.849296 -0.281844
C  -0.138294 -6.105806 -1.844168
C  1.364691 -4.469572 -0.943557
C  1.147409 -5.596396 -1.72485
H  2.982035 1.782053 0.772648
H  0.54726 3.650508 0.425268
H  1.656406 0.392744 2.2293
H  1.969895 1.250863 3.727375
H  0.314688 1.059993 3.159871
H  1.850949 3.807387 3.829122
H  1.190605 4.694636 2.45634
H  0.145219 3.65611 3.418657
H  3.563832 4.48271 1.721412
H  2.798944 2.800681 -1.541161
H  2.596543 4.406585 -2.240178
H  4.164931 3.632732 -2.279669
H  4.642548 6.138461 0.485964
H  5.394735 5.491202 -0.975026
H  3.918608 6.422771 -1.099616
H  -0.905354 0.360292 -1.973023
H  -1.276232 -1.84734 -1.391728
H  -2.842732 1.22925 1.151239
H  -3.600311 -0.486273 2.751865
H  -3.176654 -2.87975 2.313359
H  -2.205536 -5.882735 -1.292687
H  0.504443 -2.976872 0.330898
H  -0.32155 -6.985707 -2.447284
H  2.36381 -4.066697 -0.838377
H  1.973556 -6.074355 -2.234536
elementType: O N C H
totalener: -1210.10548389 hartree
nucrepener: 2478.83444734 hartree
electener: -3688.93993123 hartree
oneelecener: -6568.98776393 hartree
twoeener: 2880.04783270 hartree
cpcmener: -0.02920653 hartree
kineticenergy: 1204.70976228 hartree
xcener: -118.583182480336 hartree
chargesum: 0.0000000
charge: -0.279566 -0.449289 -0.324106 -0.087833 0.150763 -0.015730 -0.097958 -0.272740 -0.287379 -0.299564 0.368409 -0.008433 -0.240873 -0.227911 0.401432 0.030173 -0.225809 -0.214322 -0.243475 0.302699 -0.118945 -0.231118 0.312191 -0.262758 -0.214911 -0.113349 -0.138440 -0.190772 0.106513 0.095839 0.092825 0.098472 0.096175 0.099981 0.093654 0.098134 0.122695 0.079397 0.100501 0.099993 0.089306 0.096377 0.093910 0.139583 0.145794 0.146551 0.159159 0.147819 0.145217 0.157855 0.157550 0.159348 0.156969
qa: -0.2796 -0.4493 -0.3241 -0.0878 0.1508 -0.0157 -0.0980 -0.2727 -0.2874 -0.2996 0.3684 -0.0084 -0.2409 -0.2279 0.4014 0.0302 -0.2258 -0.2143 -0.2435 0.3027 -0.1189 -0.2311 0.3122 -0.2628 -0.2149 -0.1133 -0.1384 -0.1908 0.1065 0.0958 0.0928 0.0985 0.0962 0.1000 0.0937 0.0981 0.1227 0.0794 0.1005 0.1000 0.0893 0.0964 0.0939 0.1396 0.1458 0.1466 0.1592 0.1478 0.1452 0.1579 0.1576 0.1593 0.1570
va: 2.1196 2.0561 2.0915 3.1131 3.7132 3.8234 3.8046 3.8940 3.9062 3.8937 4.1759 3.7050 3.9362 3.9320 3.7371 3.5826 4.0780 3.9585 3.9700 3.7189 3.9040 4.0100 3.6728 4.0152 3.9152 3.8774 3.8884 3.9137 1.0238 1.0304 1.0144 1.0023 1.0008 0.9996 1.0016 1.0030 1.0033 1.0163 0.9980 1.0005 1.0063 0.9964 0.9964 1.0181 1.0059 1.0126 0.9891 1.0058 1.0091 0.9991 0.9891 0.9902 0.9909
dispcorr: -0.026180411 hartree
energy: -1210.131664302282
dipole: 26.53905 -24.97787 1.56118 22.48937 -22.28758 0.20178 9.77128 -8.76803 1.00324
magnitude: 1.86668 au
magnitude: 4.74472 debye
