program: Orca
programVersion: 5.0.2
elementType: O O O N C C C C C C C C C C C C C C C C C C C C C C C C H H H H H H H H H H H H H H H H H H H H H H H H H
charge: 0
multiplicity: 1
keywords: wb97x-d3
keywords: def2-TZVPP
keywords: def2/J RIJCOSX
keywords: DEFGRID2
keywords: scfconv7
keywords: smallprint printgap noloewdin
keywords: NOSOSCF
formula: C24H25NO3
InChI: InChI=1/C24H25NO3/c1-16(2)13-20-22(24(20,3)4)23(26)28-21(15-25)17-9-8-12-19(14-17)27-18-10-6-5-7-11-18/h5-14,20-22H,1-4H3
53 atoms
O  -1.191916 1.83806 1.102479
O  -0.5157 2.403818 -0.950908
O  -0.244368 -2.902609 -0.05033
N  -3.969246 0.944778 2.621445
C  2.237411 1.703795 0.531957
C  2.162508 3.157583 0.163289
C  1.007278 2.522993 0.900953
C  2.165983 0.684048 -0.578208
C  3.104175 1.259349 1.684438
C  2.960551 4.191477 0.852179
C  -0.272733 2.277833 0.221159
C  3.678033 5.163203 0.279115
C  3.814798 5.372671 -1.197905
C  4.431703 6.150728 1.119226
C  -2.41835 1.373282 0.562443
C  -2.25003 0.093183 -0.226804
C  -3.276599 1.141181 1.726794
C  -1.365815 -0.875557 0.225998
C  -2.977977 -0.104374 -1.390653
C  -1.187242 -2.035978 -0.512787
C  -2.804777 -1.279559 -2.106993
C  -1.907105 -2.247307 -1.683651
C  -0.338395 -4.23939 -0.341946
C  0.76266 -4.855535 -0.915057
C  -1.476636 -4.966717 -0.018252
C  0.725003 -6.221393 -1.1620
C  -1.50468 -6.328374 -0.279799
C  -0.407702 -6.960306 -0.851678
H  1.973629 3.330843 -0.890767
H  0.916464 2.748266 1.958404
H  1.721689 -0.250952 -0.229308
H  1.59767 1.025648 -1.44152
H  3.174735 0.454556 -0.92765
H  3.101133 1.961388 2.517177
H  2.761687 0.296323 2.06824
H  4.138994 1.135045 1.358483
H  2.949288 4.152351 1.937713
H  3.291201 4.633361 -1.800767
H  3.440545 6.35944 -1.483559
H  4.867768 5.348219 -1.490664
H  5.503146 6.112593 0.904552
H  4.111346 7.174189 0.905606
H  4.29698 5.973952 2.186433
H  -2.899627 2.138306 -0.056248
H  -0.798444 -0.738563 1.139041
H  -3.664392 0.655341 -1.742206
H  -3.360956 -1.438865 -3.021389
H  -1.766718 -3.144861 -2.272029
H  1.64237 -4.272797 -1.158453
H  -2.330192 -4.47981 0.437511
H  1.585403 -6.705308 -1.60587
H  -2.389853 -6.898427 -0.02862
H  -0.435651 -8.023553 -1.050452
elementType: O N C H
totalener: -1210.10675893 hartree
nucrepener: 2455.28277919 hartree
electener: -3665.38953812 hartree
oneelecener: -6522.05920251 hartree
twoeener: 2856.66966439 hartree
cpcmener: -0.03115204 hartree
kineticenergy: 1204.71372106 hartree
xcener: -118.584244756141 hartree
chargesum: -0.0000000
charge: -0.280177 -0.431974 -0.329082 -0.088179 0.111006 0.037797 -0.081539 -0.275188 -0.268350 -0.277366 0.347748 -0.049769 -0.251328 -0.217786 0.409267 0.049013 -0.231635 -0.284668 -0.207229 0.282474 -0.128937 -0.186288 0.236265 -0.217813 -0.168285 -0.137790 -0.154684 -0.164510 0.092435 0.093303 0.089317 0.096132 0.104346 0.088496 0.098128 0.098730 0.117363 0.090685 0.096147 0.094713 0.092923 0.092706 0.087627 0.143991 0.138705 0.144037 0.159965 0.157651 0.148298 0.158130 0.157434 0.159049 0.158698
qa: -0.2802 -0.4320 -0.3291 -0.0882 0.1110 0.0378 -0.0815 -0.2752 -0.2684 -0.2774 0.3477 -0.0498 -0.2513 -0.2178 0.4093 0.0490 -0.2316 -0.2847 -0.2072 0.2825 -0.1289 -0.1863 0.2363 -0.2178 -0.1683 -0.1378 -0.1547 -0.1645 0.0924 0.0933 0.0893 0.0961 0.1043 0.0885 0.0981 0.0987 0.1174 0.0907 0.0961 0.0947 0.0929 0.0927 0.0876 0.1440 0.1387 0.1440 0.1600 0.1577 0.1483 0.1581 0.1574 0.1590 0.1587
va: 2.1122 2.0777 2.0524 3.1120 3.6953 3.8013 3.8076 3.9013 3.9042 3.8760 4.2469 3.7656 3.9409 3.9218 3.7159 3.5835 4.0840 4.0301 3.9985 3.7280 3.9126 3.9200 3.7356 3.9926 3.9206 3.8928 3.8976 3.8880 1.0314 1.0351 1.0047 1.0152 1.0019 1.0060 1.0022 1.0017 1.0108 1.0100 0.9967 0.9974 0.9965 0.9963 1.0090 1.0141 1.0266 1.0030 0.9904 0.9963 1.0046 0.9962 0.9901 0.9903 0.9898
dispcorr: -0.025864095 hartree
energy: -1210.132623023260
dipole: 30.98113 -29.62236 1.35877 16.98680 -17.49325 -0.50645 -3.44308 2.24843 -1.19465
magnitude: 1.87881 au
magnitude: 4.77556 debye
