program: Orca
programVersion: 5.0.2
elementType: O O O N C C C C C C C C C C C C C C C C C C C C C C C C H H H H H H H H H H H H H H H H H H H H H H H H H
charge: 0
multiplicity: 1
keywords: wb97x-d3
keywords: def2-TZVPP
keywords: def2/J RIJCOSX
keywords: DEFGRID2
keywords: scfconv7
keywords: smallprint printgap noloewdin
keywords: NOSOSCF
formula: C24H25NO3
InChI: InChI=1/C24H25NO3/c1-16(2)13-20-22(24(20,3)4)23(26)28-21(15-25)17-9-8-12-19(14-17)27-18-10-6-5-7-11-18/h5-14,20-22H,1-4H3
53 atoms
O  -1.105531 1.837163 1.048577
O  -0.457462 2.077708 -1.075492
O  -0.865739 -3.10985 0.425745
N  -3.954638 1.571731 2.692791
C  2.277766 1.227655 0.359021
C  2.328074 2.625981 -0.157083
C  1.154665 2.205852 0.696504
C  2.036262 0.093297 -0.606026
C  3.156869 0.840148 1.52286
C  3.307788 3.618384 0.359204
C  -0.175698 2.049818 0.094988
C  3.052655 4.910301 0.581613
C  1.713809 5.541306 0.350713
C  4.112071 5.838545 1.092714
C  -2.402113 1.492962 0.592621
C  -2.453607 0.110233 -0.021291
C  -3.256902 1.548127 1.781169
C  -1.628536 -0.894827 0.466556
C  -3.324226 -0.140501 -1.070743
C  -1.676406 -2.153309 -0.111889
C  -3.376171 -1.411894 -1.624525
C  -2.556939 -2.424634 -1.15328
C  -0.213645 -3.996119 -0.388355
C  0.340982 -3.616968 -1.605331
C  -0.073817 -5.294605 0.081007
C  1.029815 -4.558617 -2.356407
C  0.628461 -6.221391 -0.67581
C  1.176136 -5.861753 -1.899338
H  2.088424 2.720527 -1.214091
H  1.145579 2.546924 1.725963
H  1.541657 -0.745335 -0.111467
H  1.435583 0.379999 -1.467375
H  2.991627 -0.272846 -0.987325
H  2.720662 0.001305 2.068544
H  4.14236 0.526427 1.17192
H  3.300541 1.655572 2.231881
H  4.314303 3.251935 0.54352
H  0.994388 4.872518 -0.118845
H  1.2818 5.891162 1.29265
H  1.811594 6.423575 -0.287148
H  3.798975 6.313222 2.026681
H  5.056948 5.326562 1.275962
H  4.2995 6.649207 0.383547
H  -2.785807 2.232322 -0.118879
H  -0.943551 -0.715007 1.286399
H  -3.95648 0.64961 -1.456133
H  -4.058806 -1.616946 -2.43841
H  -2.607482 -3.411738 -1.594916
H  0.245862 -2.600639 -1.967922
H  -0.507416 -5.573568 1.033395
H  1.459808 -4.264328 -3.305094
H  0.73868 -7.233205 -0.307204
H  1.716486 -6.589514 -2.490174
elementType: O N C H
totalener: -1210.10515024 hartree
nucrepener: 2501.99349838 hartree
electener: -3712.09864862 hartree
oneelecener: -6615.21999455 hartree
twoeener: 2903.12134593 hartree
cpcmener: -0.03001972 hartree
kineticenergy: 1204.70689783 hartree
xcener: -118.583061493465 hartree
chargesum: -0.0000000
charge: -0.284663 -0.437010 -0.330352 -0.087547 0.169005 -0.007550 -0.118562 -0.286029 -0.286885 -0.301624 0.357843 -0.014778 -0.236348 -0.228722 0.403714 0.036823 -0.228873 -0.254509 -0.201665 0.244604 -0.125529 -0.172743 0.298989 -0.190731 -0.251533 -0.159701 -0.122420 -0.180953 0.106514 0.100097 0.087522 0.098049 0.104423 0.099216 0.099758 0.094293 0.122598 0.079629 0.099832 0.100622 0.094172 0.089116 0.096757 0.143865 0.140825 0.145019 0.160582 0.158262 0.156267 0.146191 0.158954 0.157478 0.157709
qa: -0.2847 -0.4370 -0.3304 -0.0875 0.1690 -0.0075 -0.1186 -0.2860 -0.2869 -0.3016 0.3578 -0.0148 -0.2363 -0.2287 0.4037 0.0368 -0.2289 -0.2545 -0.2017 0.2446 -0.1255 -0.1727 0.2990 -0.1907 -0.2515 -0.1597 -0.1224 -0.1810 0.1065 0.1001 0.0875 0.0980 0.1044 0.0992 0.0998 0.0943 0.1226 0.0796 0.0998 0.1006 0.0942 0.0891 0.0968 0.1439 0.1408 0.1450 0.1606 0.1583 0.1563 0.1462 0.1590 0.1575 0.1577
va: 2.1076 2.0667 2.0621 3.1134 3.7034 3.8256 3.8206 3.8892 3.9025 3.8932 4.1908 3.7133 3.9318 3.9313 3.7179 3.6079 4.0763 4.0176 4.0000 3.7845 3.8951 3.9199 3.6560 3.8874 4.0164 3.9152 3.8898 3.9040 1.0236 1.0285 1.0015 1.0135 1.0034 1.0038 0.9998 1.0020 1.0032 1.0155 0.9985 0.9999 0.9967 1.0064 0.9962 1.0158 1.0244 1.0025 0.9899 0.9941 0.9967 1.0083 0.9909 0.9893 0.9904
dispcorr: -0.027498285 hartree
energy: -1210.132648526857
dipole: 28.39897 -26.92690 1.47207 15.56537 -15.86681 -0.30144 -2.43622 1.16732 -1.26891
magnitude: 1.96672 au
magnitude: 4.99900 debye
