program: Orca
programVersion: 5.0.2
elementType: O O O N C C C C C C C C C C C C C C C C C C C C C C C C H H H H H H H H H H H H H H H H H H H H H H H H H
charge: 0
multiplicity: 1
keywords: wb97x-d3
keywords: def2-TZVPP
keywords: def2/J RIJCOSX
keywords: DEFGRID2
keywords: scfconv7
keywords: smallprint printgap noloewdin
keywords: NOSOSCF
formula: C24H25NO3
InChI: InChI=1/C24H25NO3/c1-16(2)13-20-22(24(20,3)4)23(26)28-21(15-25)17-9-8-12-19(14-17)27-18-10-6-5-7-11-18/h5-14,20-22H,1-4H3
53 atoms
O  -1.331925 2.307536 0.113647
O  -1.076171 2.170332 -2.096926
O  -0.453921 -2.553333 1.089747
N  -3.862119 2.158459 2.226543
C  1.176122 3.991207 0.2466
C  1.587174 2.567342 0.382465
C  0.729119 2.993719 -0.810954
C  0.212177 4.581372 1.249178
C  2.186535 5.00118 -0.246579
C  2.979705 2.101956 0.168733
C  -0.625381 2.466655 -1.017789
C  3.32395 0.838341 -0.094429
C  2.323754 -0.266632 -0.251842
C  4.758518 0.432348 -0.233965
C  -2.590621 1.667352 -0.002747
C  -2.462066 0.172988 -0.192392
C  -3.287085 1.954651 1.253498
C  -1.497966 -0.531772 0.518555
C  -3.312319 -0.484581 -1.067734
C  -1.392256 -1.902034 0.342996
C  -3.207326 -1.860623 -1.217011
C  -2.25227 -2.577898 -0.516118
C  0.314637 -3.533362 0.522346
C  0.669371 -4.602091 1.333676
C  0.780761 -3.449512 -0.784233
C  1.502083 -5.592217 0.832336
C  1.605638 -4.451925 -1.273942
C  1.969778 -5.525735 -0.472787
H  1.032907 2.011145 1.133837
H  1.259626 3.07128 -1.752926
H  -0.375603 3.836072 1.779322
H  0.778213 5.134751 2.00147
H  -0.474803 5.286015 0.776731
H  2.839223 4.605016 -1.024589
H  1.67753 5.874006 -0.659772
H  2.817035 5.347687 0.574843
H  3.768035 2.842108 0.271042
H  1.319944 0.09665 -0.470278
H  2.617928 -0.941645 -1.05817
H  2.267849 -0.874341 0.656169
H  5.011268 -0.364034 0.471347
H  4.95724 0.032792 -1.232074
H  5.441715 1.263992 -0.061083
H  -3.187154 2.099891 -0.812847
H  -0.8275 -0.031639 1.207738
H  -4.053039 0.070278 -1.62952
H  -3.874599 -2.381556 -1.890785
H  -2.181433 -3.651341 -0.638858
H  0.300493 -4.653458 2.350531
H  0.515085 -2.612903 -1.418149
H  1.779065 -6.4237 1.467595
H  1.969597 -4.384867 -2.291175
H  2.615024 -6.302281 -0.861851
elementType: O N C H
totalener: -1210.10274261 hartree
nucrepener: 2556.55613460 hartree
electener: -3766.65887720 hartree
oneelecener: -6724.09277645 hartree
twoeener: 2957.43389924 hartree
cpcmener: -0.03099713 hartree
kineticenergy: 1204.71070050 hartree
xcener: -118.584760563014 hartree
chargesum: 0.0000000
charge: -0.274430 -0.445871 -0.327845 -0.086941 0.170732 -0.031022 -0.087131 -0.270314 -0.300249 -0.296685 0.368631 0.011627 -0.267336 -0.225106 0.381363 0.034642 -0.233205 -0.244343 -0.191664 0.227230 -0.128620 -0.169368 0.308399 -0.254933 -0.214499 -0.122651 -0.146865 -0.184945 0.113454 0.089257 0.088895 0.093021 0.102461 0.092526 0.100103 0.100714 0.123502 0.074042 0.094538 0.112476 0.095674 0.095674 0.088124 0.142564 0.150894 0.144945 0.160644 0.157877 0.145736 0.158985 0.157577 0.159488 0.158228
qa: -0.2744 -0.4459 -0.3278 -0.0869 0.1707 -0.0310 -0.0871 -0.2703 -0.3002 -0.2967 0.3686 0.0116 -0.2673 -0.2251 0.3814 0.0346 -0.2332 -0.2443 -0.1917 0.2272 -0.1286 -0.1694 0.3084 -0.2549 -0.2145 -0.1227 -0.1469 -0.1849 0.1135 0.0893 0.0889 0.0930 0.1025 0.0925 0.1001 0.1007 0.1235 0.0740 0.0945 0.1125 0.0957 0.0957 0.0881 0.1426 0.1509 0.1449 0.1606 0.1579 0.1457 0.1590 0.1576 0.1595 0.1582
va: 2.1098 2.0622 2.0531 3.1087 3.6903 3.8123 3.8389 3.8947 3.9234 3.8739 4.1759 3.7430 3.9499 3.9275 3.7533 3.6232 4.0692 3.9947 3.9907 3.8190 3.8950 3.9189 3.5988 4.0218 3.8681 3.8877 3.9077 3.9098 1.0115 1.0285 1.0109 1.0011 1.0002 1.0016 1.0017 0.9984 1.0032 1.0019 1.0008 0.9960 0.9948 0.9964 1.0077 1.0173 1.0165 1.0018 0.9902 0.9945 1.0085 0.9949 0.9890 0.9904 0.9900
dispcorr: -0.029350505 hartree
energy: -1210.132093111107
dipole: 26.55644 -25.10033 1.45611 8.57039 -9.32553 -0.75513 -2.77950 1.79716 -0.98234
magnitude: 1.91193 au
magnitude: 4.85974 debye
