program: Orca
programVersion: 5.0.2
elementType: O O O N C C C C C C C C C C C C C C C C C C C C C C C C H H H H H H H H H H H H H H H H H H H H H H H H H
charge: 0
multiplicity: 1
keywords: wb97x-d3
keywords: def2-TZVPP
keywords: def2/J RIJCOSX
keywords: DEFGRID2
keywords: scfconv7
keywords: smallprint printgap noloewdin
keywords: NOSOSCF
formula: C24H25NO3
InChI: InChI=1/C24H25NO3/c1-16(2)13-20-22(24(20,3)4)23(26)28-21(15-25)17-9-8-12-19(14-17)27-18-10-6-5-7-11-18/h5-14,20-22H,1-4H3
53 atoms
O  -1.344292 2.322746 0.122908
O  -1.12178 2.262028 -2.094625
O  -0.430989 -2.532784 1.095829
N  -3.862849 2.125165 2.246022
C  1.169824 3.989814 0.293931
C  1.588087 2.562205 0.333852
C  0.696601 3.056882 -0.80949
C  0.236185 4.515316 1.358982
C  2.163993 5.032023 -0.16413
C  2.972817 2.110866 0.055011
C  -0.656336 2.52431 -1.012853
C  3.311068 0.851481 -0.234916
C  2.30719 -0.254993 -0.36075
C  4.73981 0.45181 -0.437044
C  -2.596294 1.668752 0.006798
C  -2.445386 0.179235 -0.201134
C  -3.289679 1.935148 1.269158
C  -1.490465 -0.523077 0.524378
C  -3.261342 -0.475954 -1.110326
C  -1.360018 -1.889344 0.332193
C  -3.132034 -1.84773 -1.277016
C  -2.187877 -2.563358 -0.559623
C  0.321832 -3.544085 0.562245
C  0.626562 -4.610171 1.396735
C  0.821643 -3.492341 -0.733449
C  1.443704 -5.630002 0.93001
C  1.630004 -4.523702 -1.188749
C  1.945139 -5.595052 -0.363657
H  1.054228 1.960117 1.064245
H  1.203052 3.192083 -1.758177
H  -0.342696 3.738991 1.852694
H  0.825735 5.013422 2.131538
H  -0.458174 5.253686 0.95371
H  2.791588 4.690072 -0.987103
H  1.641856 5.928824 -0.502917
H  2.820357 5.32548 0.657636
H  3.760577 2.85484 0.128844
H  2.249253 -0.838804 0.562543
H  1.304233 0.106303 -0.587021
H  2.596716 -0.951071 -1.150136
H  5.023005 -0.350729 0.249582
H  4.898683 0.062264 -1.446163
H  5.427525 1.283549 -0.283834
H  -3.202521 2.102219 -0.795365
H  -0.845989 -0.023881 1.238686
H  -3.993966 0.077191 -1.68423
H  -3.772314 -2.367534 -1.977343
H  -2.101016 -3.633753 -0.696727
H  0.231357 -4.636707 2.404615
H  0.59334 -2.658514 -1.385218
H  1.682156 -6.459198 1.583589
H  2.020082 -4.48157 -2.197579
H  2.578453 -6.394285 -0.725491
elementType: O N C H
totalener: -1210.10263015 hartree
nucrepener: 2554.45681167 hartree
electener: -3764.55944181 hartree
oneelecener: -6719.87420989 hartree
twoeener: 2955.31476807 hartree
cpcmener: -0.03097293 hartree
kineticenergy: 1204.71182461 hartree
xcener: -118.584909749627 hartree
chargesum: -0.0000000
charge: -0.274123 -0.446975 -0.327732 -0.086749 0.170867 -0.032979 -0.086228 -0.268671 -0.301221 -0.294179 0.368618 0.012857 -0.276733 -0.225094 0.382709 0.043529 -0.233833 -0.260671 -0.194017 0.241901 -0.128247 -0.176367 0.314878 -0.255817 -0.221365 -0.121880 -0.144490 -0.184949 0.112804 0.089647 0.089169 0.093398 0.101426 0.092320 0.100196 0.101175 0.123848 0.113163 0.079595 0.094706 0.096210 0.095360 0.087825 0.141863 0.149579 0.145166 0.160815 0.157337 0.145901 0.160181 0.157675 0.159056 0.158543
qa: -0.2741 -0.4470 -0.3277 -0.0867 0.1709 -0.0330 -0.0862 -0.2687 -0.3012 -0.2942 0.3686 0.0129 -0.2767 -0.2251 0.3827 0.0435 -0.2338 -0.2607 -0.1940 0.2419 -0.1282 -0.1764 0.3149 -0.2558 -0.2214 -0.1219 -0.1445 -0.1849 0.1128 0.0896 0.0892 0.0934 0.1014 0.0923 0.1002 0.1012 0.1238 0.1132 0.0796 0.0947 0.0962 0.0954 0.0878 0.1419 0.1496 0.1452 0.1608 0.1573 0.1459 0.1602 0.1577 0.1591 0.1585
va: 2.1110 2.0610 2.0561 3.1085 3.6992 3.8139 3.8420 3.8926 3.9241 3.8734 4.1798 3.7401 3.9515 3.9277 3.7545 3.6132 4.0696 3.9954 3.9907 3.8048 3.8967 3.9184 3.5996 4.0248 3.8780 3.8853 3.9085 3.9118 1.0102 1.0284 1.0110 1.0010 1.0006 1.0014 1.0018 0.9983 1.0033 0.9959 1.0007 1.0011 0.9945 0.9962 1.0080 1.0177 1.0191 1.0019 0.9902 0.9949 1.0084 0.9929 0.9890 0.9907 0.9900
dispcorr: -0.029274166 hartree
energy: -1210.131904311846
dipole: 26.53717 -25.04086 1.49631 8.38346 -9.20389 -0.82043 -2.97891 1.99866 -0.98026
magnitude: 1.96798 au
magnitude: 5.00221 debye
