program: Orca
programVersion: 5.0.2
elementType: O O O N C C C C C C C C C C C C C C C C C C C C C C C C H H H H H H H H H H H H H H H H H H H H H H H H H
charge: 0
multiplicity: 1
keywords: wb97x-d3
keywords: def2-TZVPP
keywords: def2/J RIJCOSX
keywords: DEFGRID2
keywords: scfconv7
keywords: smallprint printgap noloewdin
keywords: NOSOSCF
formula: C24H25NO3
InChI: InChI=1/C24H25NO3/c1-16(2)13-20-22(24(20,3)4)23(26)28-21(15-25)17-9-8-12-19(14-17)27-18-10-6-5-7-11-18/h5-14,20-22H,1-4H3
53 atoms
O  -0.096077 0.716349 0.936025
O  -0.881577 2.68167 0.214265
O  -1.833715 -3.358568 -1.950485
N  -1.124175 -1.285126 3.344367
C  1.920521 2.954437 -1.156707
C  2.025236 3.598337 0.189523
C  1.462658 2.184588 0.069675
C  0.919458 3.509079 -2.141186
C  3.158811 2.415709 -1.833935
C  3.304359 3.777881 0.901491
C  0.049661 1.935926 0.382543
C  3.66205 4.814954 1.666332
C  2.812533 6.018239 1.940174
C  5.000125 4.833175 2.343758
C  -1.412413 0.314495 1.298185
C  -2.114962 -0.367823 0.151143
C  -1.240174 -0.588557 2.438747
C  -1.618726 -1.572819 -0.337444
C  -3.222715 0.230609 -0.428474
C  -2.260449 -2.188112 -1.402176
C  -3.844014 -0.389629 -1.504651
C  -3.373101 -1.595757 -1.99141
C  -1.096465 -4.237534 -1.19675
C  0.140517 -4.631748 -1.681067
C  -1.601227 -4.760976 -0.013288
C  0.88012 -5.569054 -0.971922
C  -0.847217 -5.687368 0.690965
C  0.392813 -6.095474 0.215713
H  1.269807 4.354786 0.374006
H  2.131323 1.3909 0.383244
H  1.416489 4.235256 -2.78759
H  0.520326 2.720563 -2.782512
H  0.081706 4.016855 -1.669473
H  2.883711 1.684721 -2.596673
H  3.70404 3.221386 -2.329725
H  3.846482 1.923969 -1.147213
H  4.018709 2.966022 0.800979
H  1.904599 6.065347 1.341287
H  2.517836 6.047256 2.993101
H  3.378036 6.935244 1.755224
H  5.570166 3.922498 2.158849
H  5.601495 5.681429 2.005561
H  4.890578 4.946181 3.425911
H  -2.004191 1.1657 1.648418
H  -0.742735 -2.024781 0.113472
H  -3.6016 1.168916 -0.044851
H  -4.709686 0.068392 -1.964445
H  -3.863016 -2.083842 -2.824636
H  0.518061 -4.213519 -2.605794
H  -2.572271 -4.453082 0.354884
H  1.844864 -5.881643 -1.350171
H  -1.236862 -6.097015 1.613888
H  0.974064 -6.822054 0.768085
elementType: O N C H
totalener: -1210.10792142 hartree
nucrepener: 2435.98718314 hartree
electener: -3646.09510456 hartree
oneelecener: -6483.61400025 hartree
twoeener: 2837.51889569 hartree
cpcmener: -0.02955346 hartree
kineticenergy: 1204.70425236 hartree
xcener: -118.581849864539 hartree
chargesum: -0.0000000
charge: -0.287869 -0.456024 -0.325906 -0.090927 0.099986 0.038465 -0.096837 -0.275645 -0.271388 -0.269840 0.402690 -0.048203 -0.254674 -0.216414 0.421330 0.003360 -0.232533 -0.194072 -0.191758 0.248607 -0.114766 -0.231362 0.251726 -0.220208 -0.179351 -0.133889 -0.143625 -0.169758 0.098115 0.088494 0.096318 0.099227 0.093143 0.097179 0.098037 0.089385 0.115630 0.090361 0.099616 0.093372 0.087134 0.094268 0.092297 0.135555 0.142149 0.143999 0.157754 0.147509 0.147314 0.156988 0.157522 0.158876 0.158642
qa: -0.2879 -0.4560 -0.3259 -0.0909 0.1000 0.0385 -0.0968 -0.2756 -0.2714 -0.2698 0.4027 -0.0482 -0.2547 -0.2164 0.4213 0.0034 -0.2325 -0.1941 -0.1918 0.2486 -0.1148 -0.2314 0.2517 -0.2202 -0.1794 -0.1339 -0.1436 -0.1698 0.0981 0.0885 0.0963 0.0992 0.0931 0.0972 0.0980 0.0894 0.1156 0.0904 0.0996 0.0934 0.0871 0.0943 0.0923 0.1356 0.1421 0.1440 0.1578 0.1475 0.1473 0.1570 0.1575 0.1589 0.1586
va: 2.1272 2.0565 2.0824 3.1093 3.6933 3.7903 3.8409 3.9013 3.9127 3.8874 4.1692 3.7652 3.9404 3.9209 3.7291 3.6396 4.0754 3.9471 3.9496 3.7722 3.9106 4.0026 3.7128 4.0047 3.9297 3.8860 3.8907 3.8943 1.0255 1.0367 0.9997 0.9995 1.0194 1.0015 1.0013 1.0069 1.0123 1.0102 0.9955 0.9979 1.0094 0.9963 0.9961 1.0195 1.0157 1.0087 0.9897 1.0059 1.0059 0.9963 0.9896 0.9902 0.9901
dispcorr: -0.024282354 hartree
energy: -1210.132203773729
dipole: 26.22608 -25.45735 0.76873 28.98037 -28.27016 0.71022 -2.41250 1.36278 -1.04972
magnitude: 1.48232 au
magnitude: 3.76775 debye
