program: Orca
programVersion: 5.0.2
elementType: O O O N C C C C C C C C C C C C C C C C C C C C C C C C H H H H H H H H H H H H H H H H H H H H H H H H H
charge: 0
multiplicity: 1
keywords: wb97x-d3
keywords: def2-TZVPP
keywords: def2/J RIJCOSX
keywords: DEFGRID2
keywords: scfconv7
keywords: smallprint printgap noloewdin
keywords: NOSOSCF
formula: C24H25NO3
InChI: InChI=1/C24H25NO3/c1-16(2)13-20-22(24(20,3)4)23(26)28-21(15-25)17-9-8-12-19(14-17)27-18-10-6-5-7-11-18/h5-14,20-22H,1-4H3
53 atoms
O  0.330447 1.275125 -0.827479
O  1.659135 0.711657 0.880143
O  -2.183819 -4.111281 0.406054
N  -0.518393 -0.157156 -3.667314
C  0.899898 3.623116 1.834247
C  2.26662 3.658789 1.22651
C  1.136272 3.018159 0.455711
C  0.658158 2.738834 3.031382
C  0.080111 4.889321 1.853993
C  2.863804 4.911684 0.695371
C  1.104682 1.565889 0.238798
C  3.661234 5.728575 1.388104
C  4.041758 5.496426 2.817498
C  4.232154 6.968295 0.770541
C  0.138366 -0.088787 -1.138108
C  -0.958679 -0.738038 -0.317488
C  -0.229833 -0.110831 -2.556747
C  -1.03157 -2.124609 -0.320065
C  -1.890272 0.018502 0.379475
C  -2.06541 -2.754521 0.359142
C  -2.895413 -0.62999 1.084174
C  -2.997299 -2.010947 1.070881
C  -1.894034 -4.863556 -0.702048
C  -2.289906 -4.479654 -1.978198
C  -1.232436 -6.06534 -0.495163
C  -2.002324 -5.308153 -3.052855
C  -0.962946 -6.88958 -1.578779
C  -1.338777 -6.513051 -2.860782
H  2.966915 2.95415 1.667361
H  0.732732 3.598267 -0.367196
H  1.345714 1.898186 3.093258
H  0.782445 3.325582 3.943661
H  -0.359873 2.343606 3.034562
H  -0.982311 4.658636 1.953442
H  0.363943 5.511687 2.705218
H  0.207467 5.486809 0.951989
H  2.625164 5.171575 -0.332129
H  3.688953 6.319991 3.444364
H  3.638083 4.572332 3.229033
H  5.128691 5.469695 2.931981
H  3.940298 7.858205 1.334747
H  5.325232 6.943755 0.778897
H  3.907545 7.102833 -0.261372
H  1.06837 -0.658664 -1.035097
H  -0.287938 -2.704466 -0.855091
H  -1.84938 1.099357 0.382617
H  -3.621416 -0.049026 1.637567
H  -3.7927 -2.512529 1.607444
H  -2.8180 -3.54782 -2.139945
H  -0.935388 -6.353038 0.505995
H  -2.30696 -5.007645 -4.047377
H  -0.448214 -7.828204 -1.416791
H  -1.120109 -7.155079 -3.703861
elementType: O N C H
totalener: -1210.10573214 hartree
nucrepener: 2408.04240498 hartree
electener: -3618.14813712 hartree
oneelecener: -6427.35290153 hartree
twoeener: 2809.20476441 hartree
cpcmener: -0.03028556 hartree
kineticenergy: 1204.70430437 hartree
xcener: -118.582284021350 hartree
chargesum: 0.0000000
charge: -0.289370 -0.442064 -0.328079 -0.087862 0.138557 -0.022238 -0.102786 -0.291574 -0.271627 -0.245595 0.374219 -0.040167 -0.245978 -0.229107 0.391396 0.060859 -0.225692 -0.226665 -0.210460 0.263299 -0.129004 -0.223025 0.278288 -0.187585 -0.245835 -0.142035 -0.121284 -0.184962 0.104568 0.094066 0.096745 0.098603 0.098363 0.099706 0.097646 0.092686 0.120155 0.097011 0.086291 0.100088 0.093447 0.095265 0.089461 0.143452 0.146334 0.149970 0.157783 0.148361 0.155521 0.145869 0.159073 0.157818 0.158093
qa: -0.2894 -0.4421 -0.3281 -0.0879 0.1386 -0.0222 -0.1028 -0.2916 -0.2716 -0.2456 0.3742 -0.0402 -0.2460 -0.2291 0.3914 0.0609 -0.2257 -0.2267 -0.2105 0.2633 -0.1290 -0.2230 0.2783 -0.1876 -0.2458 -0.1420 -0.1213 -0.1850 0.1046 0.0941 0.0967 0.0986 0.0984 0.0997 0.0976 0.0927 0.1202 0.0970 0.0863 0.1001 0.0934 0.0953 0.0895 0.1435 0.1463 0.1500 0.1578 0.1484 0.1555 0.1459 0.1591 0.1578 0.1581
va: 2.1049 2.0683 2.0811 3.1149 3.6721 3.8304 3.8632 3.8952 3.9063 3.8563 4.1898 3.7095 3.9371 3.9284 3.7355 3.6255 4.0565 3.9882 3.9505 3.7439 3.9220 4.0086 3.6947 3.9031 4.0090 3.8913 3.8847 3.9063 1.0207 1.0369 1.0171 1.0015 1.0014 1.0034 1.0012 1.0026 1.0062 0.9973 1.0086 0.9993 0.9963 0.9958 1.0075 1.0221 1.0049 1.0091 0.9907 1.0048 0.9980 1.0079 0.9903 0.9891 0.9905
dispcorr: -0.025484027 hartree
energy: -1210.131216167134
dipole: 16.22473 -16.09172 0.13301 35.89164 -34.77601 1.11563 17.74875 -16.40909 1.33967
magnitude: 1.74844 au
magnitude: 4.44418 debye
