program: Orca
programVersion: 5.0.2
elementType: O O O N C C C C C C C C C C C C C C C C C C C C C C C C H H H H H H H H H H H H H H H H H H H H H H H H H
charge: 0
multiplicity: 1
keywords: wb97x-d3
keywords: def2-TZVPP
keywords: def2/J RIJCOSX
keywords: DEFGRID2
keywords: scfconv7
keywords: smallprint printgap noloewdin
keywords: NOSOSCF
formula: C24H25NO3
InChI: InChI=1/C24H25NO3/c1-16(2)13-20-22(24(20,3)4)23(26)28-21(15-25)17-9-8-12-19(14-17)27-18-10-6-5-7-11-18/h5-14,20-22H,1-4H3
53 atoms
O  -1.046848 1.697101 -0.062109
O  0.767372 0.710792 -0.930943
O  -1.727746 -3.794438 0.277142
N  -3.725367 2.633214 -1.752823
C  1.98764 1.544092 1.843184
C  2.469682 2.489121 0.786452
C  0.981559 2.216213 0.91951
C  2.305901 0.076635 1.690167
C  1.940133 1.983891 3.286249
C  2.968897 3.844881 1.087968
C  0.277001 1.457082 -0.121822
C  4.031791 4.444967 0.541628
C  4.934963 3.830862 -0.483927
C  4.405386 5.842665 0.935207
C  -1.897049 0.956741 -0.935702
C  -2.471593 -0.234325 -0.209407
C  -2.925566 1.897831 -1.380849
C  -1.839272 -1.463596 -0.367193
C  -3.548666 -0.096826 0.655044
C  -2.297733 -2.562367 0.34817
C  -3.997684 -1.205604 1.358974
C  -3.380908 -2.435352 1.211814
C  -0.805379 -4.059996 -0.707172
C  -1.220007 -4.239934 -2.019085
C  0.527673 -4.188778 -0.352747
C  -0.278816 -4.558374 -2.986759
C  1.45929 -4.515524 -1.329301
C  1.060769 -4.696875 -2.646146
H  2.930196 1.996804 -0.063211
H  0.38943 2.99548 1.386206
H  2.460373 -0.227176 0.657208
H  3.224228 -0.152259 2.234786
H  1.512753 -0.545129 2.111114
H  2.92343 1.88044 3.749975
H  1.622535 3.018477 3.409138
H  1.242837 1.360345 3.84911
H  2.398176 4.409146 1.819858
H  4.898709 4.398907 -1.417579
H  5.974137 3.863783 -0.14662
H  4.699973 2.794709 -0.718888
H  3.718843 6.263792 1.669857
H  5.413474 5.876704 1.357302
H  4.414253 6.50578 0.06566
H  -1.355807 0.629438 -1.827978
H  -0.996366 -1.548884 -1.040845
H  -4.042282 0.858574 0.783675
H  -4.841221 -1.111303 2.030017
H  -3.734047 -3.298735 1.761852
H  -2.266284 -4.138673 -2.280487
H  0.832385 -4.042904 0.676129
H  -0.59678 -4.702825 -4.011193
H  2.501165 -4.623507 -1.056861
H  1.789979 -4.949493 -3.404644
elementType: O N C H
totalener: -1210.10743577 hartree
nucrepener: 2466.87532715 hartree
electener: -3676.98276292 hartree
oneelecener: -6545.15693939 hartree
twoeener: 2868.17417647 hartree
cpcmener: -0.02889670 hartree
kineticenergy: 1204.70428720 hartree
xcener: -118.581518022456 hartree
chargesum: -0.0000000
charge: -0.277468 -0.453241 -0.323938 -0.090527 0.104120 0.044495 -0.106750 -0.279692 -0.270338 -0.273228 0.406643 -0.049584 -0.251688 -0.216979 0.392795 -0.025935 -0.219871 -0.169100 -0.219756 0.296511 -0.115444 -0.235876 0.231953 -0.171761 -0.192609 -0.153351 -0.149117 -0.152583 0.093510 0.090590 0.093651 0.098143 0.099304 0.097964 0.088933 0.097805 0.116460 0.097452 0.094093 0.089821 0.087476 0.093161 0.092877 0.131435 0.134009 0.139714 0.158899 0.146517 0.155102 0.148236 0.159576 0.158586 0.159006
qa: -0.2775 -0.4532 -0.3239 -0.0905 0.1041 0.0445 -0.1067 -0.2797 -0.2703 -0.2732 0.4066 -0.0496 -0.2517 -0.2170 0.3928 -0.0259 -0.2199 -0.1691 -0.2198 0.2965 -0.1154 -0.2359 0.2320 -0.1718 -0.1926 -0.1534 -0.1491 -0.1526 0.0935 0.0906 0.0937 0.0981 0.0993 0.0980 0.0889 0.0978 0.1165 0.0975 0.0941 0.0898 0.0875 0.0932 0.0929 0.1314 0.1340 0.1397 0.1589 0.1465 0.1551 0.1482 0.1596 0.1586 0.1590
va: 2.1204 2.0578 2.0882 3.1098 3.6964 3.7759 3.8444 3.9076 3.9100 3.8792 4.1771 3.7693 3.9408 3.9211 3.7400 3.7477 4.0677 3.8716 4.0029 3.7321 3.9181 4.0180 3.7253 3.9479 3.9843 3.8948 3.8939 3.8835 1.0293 1.0361 1.0174 1.0010 0.9993 1.0016 1.0065 1.0015 1.0120 0.9964 0.9977 1.0104 1.0092 0.9965 0.9962 1.0257 1.0275 1.0101 0.9894 1.0073 0.9980 1.0040 0.9900 0.9899 0.9900
dispcorr: -0.024872327 hartree
energy: -1210.132308093085
dipole: 32.42927 -30.88729 1.54198 17.15901 -17.87374 -0.71473 11.53365 -10.56395 0.96970
magnitude: 1.95675 au
magnitude: 4.97366 debye
