program: Orca
programVersion: 5.0.2
elementType: O O O N C C C C C C C C C C C C C C C C C C C C C C C C H H H H H H H H H H H H H H H H H H H H H H H H H
charge: 0
multiplicity: 1
keywords: wb97x-d3
keywords: def2-TZVPP
keywords: def2/J RIJCOSX
keywords: DEFGRID2
keywords: scfconv7
keywords: smallprint printgap noloewdin
keywords: NOSOSCF
formula: C24H25NO3
InChI: InChI=1/C24H25NO3/c1-16(2)13-20-22(24(20,3)4)23(26)28-21(15-25)17-9-8-12-19(14-17)27-18-10-6-5-7-11-18/h5-14,20-22H,1-4H3
53 atoms
O  -0.066528 1.01453 0.761555
O  -1.088347 2.969449 0.369549
O  -1.373784 -3.371109 -1.922699
N  -0.719503 -1.074621 3.244374
C  1.473739 3.579301 -1.333729
C  1.684623 4.151806 0.023495
C  1.246643 2.702509 -0.107816
C  0.311739 4.067951 -2.162307
C  2.674552 3.194128 -2.1641
C  3.040766 4.458975 0.547842
C  -0.089043 2.296418 0.342214
C  3.452834 4.232415 1.797533
C  2.58649 3.618426 2.854107
C  4.84734 4.566086 2.230209
C  -1.293578 0.435659 1.191283
C  -1.929385 -0.351389 0.073141
C  -0.958747 -0.413151 2.336713
C  -1.339527 -1.531155 -0.367498
C  -3.068961 0.142725 -0.546405
C  -1.918662 -2.22761 -1.418261
C  -3.625839 -0.555822 -1.608376
C  -3.061971 -1.743962 -2.042314
C  -0.837832 -4.316261 -1.088753
C  0.293221 -4.982954 -1.538901
C  -1.421317 -4.651172 0.127174
C  0.844041 -5.993512 -0.764279
C  -0.851719 -5.655667 0.89615
C  0.280635 -6.329577 0.458615
H  0.89142 4.818308 0.355826
H  2.017388 1.961531 0.069253
H  -0.087161 3.27409 -2.795978
H  -0.504815 4.466785 -1.565243
H  0.652149 4.86973 -2.82008
H  2.399949 2.436765 -2.900707
H  3.060141 4.057723 -2.709334
H  3.488653 2.788826 -1.563462
H  3.736288 4.915141 -0.15163
H  1.538662 3.548489 2.567799
H  2.932956 2.610904 3.101682
H  2.63946 4.196702 3.779515
H  5.444622 4.979384 1.417454
H  4.843193 5.290257 3.049056
H  5.361078 3.677721 2.607605
H  -1.986292 1.20169 1.552336
H  -0.438811 -1.905708 0.105909
H  -3.520127 1.064747 -0.203277
H  -4.514489 -0.177806 -2.096172
H  -3.50128 -2.297495 -2.862713
H  0.733911 -4.71569 -2.491033
H  -2.312171 -4.143759 0.475691
H  1.72504 -6.513072 -1.118498
H  -1.304718 -5.914428 1.844379
H  0.717427 -7.112352 1.064222
elementType: O N C H
totalener: -1210.10555842 hartree
nucrepener: 2450.51808151 hartree
electener: -3660.62363993 hartree
oneelecener: -6512.53791577 hartree
twoeener: 2851.91427585 hartree
cpcmener: -0.02812358 hartree
kineticenergy: 1204.71074120 hartree
xcener: -118.581987028407 hartree
chargesum: -0.0000000
charge: -0.287139 -0.457103 -0.328079 -0.090742 0.144590 -0.004039 -0.124645 -0.283276 -0.283448 -0.296836 0.400896 -0.012787 -0.239298 -0.227005 0.414293 0.022093 -0.229048 -0.199665 -0.182182 0.236373 -0.120261 -0.225680 0.284045 -0.250779 -0.189678 -0.119281 -0.144048 -0.187730 0.107490 0.094999 0.100619 0.094139 0.095405 0.097879 0.099284 0.093991 0.121146 0.083262 0.101954 0.101213 0.089140 0.096426 0.094263 0.131090 0.145834 0.145764 0.159320 0.149001 0.146268 0.155716 0.158106 0.159638 0.158513
qa: -0.2871 -0.4571 -0.3281 -0.0907 0.1446 -0.0040 -0.1246 -0.2833 -0.2834 -0.2968 0.4009 -0.0128 -0.2393 -0.2270 0.4143 0.0221 -0.2290 -0.1997 -0.1822 0.2364 -0.1203 -0.2257 0.2840 -0.2508 -0.1897 -0.1193 -0.1440 -0.1877 0.1075 0.0950 0.1006 0.0941 0.0954 0.0979 0.0993 0.0940 0.1211 0.0833 0.1020 0.1012 0.0891 0.0964 0.0943 0.1311 0.1458 0.1458 0.1593 0.1490 0.1463 0.1557 0.1581 0.1596 0.1585
va: 2.1155 2.0528 2.0816 3.1080 3.7031 3.8108 3.8303 3.8953 3.9084 3.8939 4.1466 3.7110 3.9359 3.9321 3.7329 3.6393 4.0794 3.9839 3.9379 3.7774 3.9053 4.0137 3.6954 4.0103 3.9012 3.8857 3.8957 3.9087 1.0209 1.0303 0.9991 1.0180 1.0010 1.0029 1.0000 1.0022 1.0039 1.0110 0.9982 1.0001 1.0064 0.9966 0.9962 1.0253 1.0108 1.0084 0.9895 1.0047 1.0082 0.9976 0.9890 0.9902 0.9905
dispcorr: -0.025320189 hartree
energy: -1210.130878609609
dipole: 22.37536 -21.91428 0.46108 25.27169 -24.72042 0.55127 -1.46992 0.37522 -1.09470
magnitude: 1.30952 au
magnitude: 3.32854 debye
