program: Orca
programVersion: 5.0.2
elementType: O O O N C C C C C C C C C C C C C C C C C C C C C C C C H H H H H H H H H H H H H H H H H H H H H H H H H
charge: 0
multiplicity: 1
keywords: wb97x-d3
keywords: def2-TZVPP
keywords: def2/J RIJCOSX
keywords: DEFGRID2
keywords: scfconv7
keywords: smallprint printgap noloewdin
keywords: NOSOSCF
formula: C24H25NO3
InChI: InChI=1/C24H25NO3/c1-16(2)13-20-22(24(20,3)4)23(26)28-21(15-25)17-9-8-12-19(14-17)27-18-10-6-5-7-11-18/h5-14,20-22H,1-4H3
53 atoms
O  0.135319 0.959786 0.600829
O  -0.993564 2.896203 0.593953
O  -1.475548 -3.580005 -1.975039
N  -0.147812 -1.371499 2.925473
C  1.384339 3.796569 -1.259342
C  1.592983 4.317996 0.118418
C  1.303598 2.83922 -0.074326
C  0.140571 4.192018 -2.015897
C  2.582275 3.589393 -2.154199
C  2.926396 4.755939 0.607214
C  0.027242 2.287403 0.394154
C  3.382396 4.590921 1.851423
C  2.606575 3.904209 2.932473
C  4.736806 5.086106 2.256707
C  -1.011348 0.259071 1.075907
C  -1.698974 -0.472835 -0.049892
C  -0.519433 -0.655106 2.10864
C  -1.241423 -1.715829 -0.468583
C  -2.770874 0.135066 -0.692808
C  -1.884846 -2.363089 -1.515064
C  -3.383428 -0.509993 -1.756573
C  -2.952812 -1.761857 -2.166599
C  -1.061942 -4.542791 -1.091634
C  0.021211 -5.324302 -1.467325
C  -1.725923 -4.77833 0.106499
C  0.443509 -6.350132 -0.633488
C  -1.284429 -5.799245 0.935278
C  -0.200936 -6.588331 0.572375
H  0.747739 4.874427 0.517911
H  2.148281 2.16763 0.026045
H  -0.695485 4.444394 -1.367594
H  0.353273 5.072005 -2.626253
H  -0.181658 3.396284 -2.690461
H  2.361312 2.844935 -2.921439
H  2.847083 4.517886 -2.664341
H  3.461441 3.247306 -1.608108
H  3.558504 5.273304 -0.109512
H  3.116718 2.992051 3.254298
H  2.533102 4.542142 3.817013
H  1.594904 3.633453 2.63506
H  5.269767 5.555211 1.429617
H  4.662147 5.816253 3.066992
H  5.35538 4.268241 2.635827
H  -1.715868 0.942423 1.558514
H  -0.395727 -2.184872 0.021373
H  -3.129048 1.102018 -0.364291
H  -4.218585 -0.042532 -2.261133
H  -3.443519 -2.275225 -2.983923
H  0.526268 -5.132327 -2.40594
H  -2.580019 -4.179036 0.396726
H  1.287387 -6.96036 -0.928836
H  -1.799309 -5.979807 1.870235
H  0.136281 -7.383747 1.223837
elementType: O N C H
totalener: -1210.10595804 hartree
nucrepener: 2437.09000250 hartree
electener: -3647.19596054 hartree
oneelecener: -6485.72499032 hartree
twoeener: 2838.52902978 hartree
cpcmener: -0.02765851 hartree
kineticenergy: 1204.70385447 hartree
xcener: -118.581338285182 hartree
chargesum: -0.0000000
charge: -0.282944 -0.457240 -0.327848 -0.090431 0.149016 -0.015617 -0.120770 -0.279603 -0.284812 -0.293396 0.404499 -0.010944 -0.239830 -0.227634 0.405047 0.013103 -0.222719 -0.183432 -0.178737 0.225490 -0.126052 -0.218261 0.273638 -0.243886 -0.180136 -0.122654 -0.146328 -0.182854 0.106355 0.095858 0.093403 0.095951 0.099865 0.097693 0.099260 0.094269 0.121105 0.100262 0.100440 0.080606 0.088781 0.096304 0.094387 0.132415 0.140470 0.145911 0.158464 0.148312 0.146100 0.154907 0.157337 0.159019 0.157863
qa: -0.2829 -0.4572 -0.3278 -0.0904 0.1490 -0.0156 -0.1208 -0.2796 -0.2848 -0.2934 0.4045 -0.0109 -0.2398 -0.2276 0.4050 0.0131 -0.2227 -0.1834 -0.1787 0.2255 -0.1261 -0.2183 0.2736 -0.2439 -0.1801 -0.1227 -0.1463 -0.1829 0.1064 0.0959 0.0934 0.0960 0.0999 0.0977 0.0993 0.0943 0.1211 0.1003 0.1004 0.0806 0.0888 0.0963 0.0944 0.1324 0.1405 0.1459 0.1585 0.1483 0.1461 0.1549 0.1573 0.1590 0.1579
va: 2.1138 2.0520 2.0785 3.1062 3.7008 3.8147 3.8250 3.8951 3.9094 3.8903 4.1482 3.7085 3.9365 3.9312 3.7336 3.6640 4.0756 3.9785 3.9223 3.7969 3.9140 4.0124 3.7002 4.0067 3.8943 3.8866 3.8964 3.9041 1.0235 1.0303 1.0171 1.0013 0.9993 1.0032 0.9998 1.0020 1.0039 0.9984 0.9997 1.0136 1.0065 0.9964 0.9966 1.0260 1.0118 1.0123 0.9899 1.0046 1.0076 0.9972 0.9892 0.9903 0.9904
dispcorr: -0.025245549 hartree
energy: -1210.131203584779
dipole: 20.44731 -20.22190 0.22541 28.49110 -27.74420 0.74691 -0.40327 -0.62928 -1.03255
magnitude: 1.29416 au
magnitude: 3.28949 debye
