program: Orca
programVersion: 5.0.2
elementType: O O O N C C C C C C C C C C C C C C C C C C C C C C C C H H H H H H H H H H H H H H H H H H H H H H H H H
charge: 0
multiplicity: 1
keywords: wb97x-d3
keywords: def2-TZVPP
keywords: def2/J RIJCOSX
keywords: DEFGRID2
keywords: scfconv7
keywords: smallprint printgap noloewdin
keywords: NOSOSCF
formula: C24H25NO3
InChI: InChI=1/C24H25NO3/c1-16(2)13-20-22(24(20,3)4)23(26)28-21(15-25)17-9-8-12-19(14-17)27-18-10-6-5-7-11-18/h5-14,20-22H,1-4H3
53 atoms
O  -1.564842 2.043124 0.134679
O  0.034795 0.660999 0.849124
O  -1.67767 -3.707991 -0.67277
N  -2.678654 0.409962 2.902293
C  1.750581 3.308553 0.822812
C  2.056462 2.510022 -0.406021
C  0.612958 2.8072 -0.055403
C  2.009666 2.688287 2.173067
C  1.979556 4.800159 0.80294
C  2.619198 3.121256 -1.632517
C  -0.277935 1.718108 0.363298
C  3.841582 2.905752 -2.127026
C  4.864901 2.017331 -1.489126
C  4.287316 3.574923 -3.391859
C  -2.551279 1.04829 0.370055
C  -2.41846 -0.125817 -0.573905
C  -2.585406 0.672347 1.788055
C  -2.120854 -1.403773 -0.127458
C  -2.578025 0.124571 -1.932943
C  -1.955721 -2.428449 -1.050899
C  -2.428138 -0.911371 -2.84075
C  -2.108056 -2.189185 -2.408596
C  -0.87701 -3.95171 0.41196
C  -1.246241 -4.998102 1.24428
C  0.287045 -3.230352 0.651027
C  -0.441351 -5.326716 2.325859
C  1.074754 -3.562513 1.743529
C  0.71694 -4.607646 2.58492
H  2.363868 1.488321 -0.203916
H  0.129568 3.574305 -0.650654
H  1.956516 1.601759 2.16784
H  3.011671 2.961639 2.510446
H  1.302113 3.057626 2.918424
H  1.383289 5.290357 1.574987
H  3.029299 5.025056 1.003387
H  1.721264 5.256409 -0.152214
H  1.968061 3.805638 -2.169091
H  5.218505 1.26042 -2.194216
H  5.743906 2.599555 -1.198432
H  4.504377 1.503852 -0.599148
H  3.512297 4.213569 -3.81621
H  5.175153 4.189887 -3.220992
H  4.565447 2.836371 -4.148749
H  -3.496349 1.560516 0.171455
H  -2.007605 -1.604833 0.930638
H  -2.816972 1.120662 -2.284048
H  -2.551823 -0.722252 -3.898916
H  -1.979628 -2.99704 -3.117885
H  -2.154456 -5.552709 1.043602
H  0.583269 -2.417624 -0.000643
H  -0.73034 -6.144388 2.97354
H  1.979006 -2.998153 1.932008
H  1.338379 -4.860788 3.433745
elementType: O N C H
totalener: -1210.10502622 hartree
nucrepener: 2506.36765665 hartree
electener: -3716.47268287 hartree
oneelecener: -6625.07637236 hartree
twoeener: 2908.60368949 hartree
cpcmener: -0.03156718 hartree
kineticenergy: 1204.71674774 hartree
xcener: -118.586662583699 hartree
chargesum: -0.0000000
charge: -0.286936 -0.452585 -0.327684 -0.079517 0.142839 0.014343 -0.138896 -0.288677 -0.260280 -0.273431 0.428509 -0.035313 -0.251285 -0.223500 0.475992 -0.022531 -0.254426 -0.175188 -0.261079 0.270211 -0.107732 -0.238946 0.281508 -0.247742 -0.187609 -0.121308 -0.141942 -0.183647 0.102908 0.087861 0.094694 0.095706 0.100075 0.098424 0.096584 0.089532 0.119063 0.095152 0.096893 0.089559 0.088487 0.092824 0.094133 0.144711 0.138503 0.144001 0.158597 0.147611 0.145316 0.153081 0.157211 0.158641 0.157288
qa: -0.2869 -0.4526 -0.3277 -0.0795 0.1428 0.0143 -0.1389 -0.2887 -0.2603 -0.2734 0.4285 -0.0353 -0.2513 -0.2235 0.4760 -0.0225 -0.2544 -0.1752 -0.2611 0.2702 -0.1077 -0.2389 0.2815 -0.2477 -0.1876 -0.1213 -0.1419 -0.1836 0.1029 0.0879 0.0947 0.0957 0.1001 0.0984 0.0966 0.0895 0.1191 0.0952 0.0969 0.0896 0.0885 0.0928 0.0941 0.1447 0.1385 0.1440 0.1586 0.1476 0.1453 0.1531 0.1572 0.1586 0.1573
va: 2.1297 2.0507 2.0866 3.1057 3.6800 3.7735 3.9302 3.9066 3.9016 3.8699 4.1107 3.7261 3.9449 3.9248 3.8336 3.6814 4.0846 3.8766 3.9949 3.7915 3.8925 4.0178 3.6998 4.0113 3.9010 3.8835 3.8932 3.9072 1.0219 1.0402 1.0181 1.0006 0.9997 1.0028 1.0030 1.0040 1.0085 0.9982 0.9972 1.0086 1.0084 0.9965 0.9961 0.9914 1.0153 1.0078 0.9889 1.0056 1.0079 1.0038 0.9893 0.9907 0.9906
dispcorr: -0.025844478 hartree
energy: -1210.130870696595
dipole: 31.63908 -30.90106 0.73802 22.75915 -21.26813 1.49102 -6.88573 4.93950 -1.94623
magnitude: 2.56039 au
magnitude: 6.50800 debye
