program: Orca
programVersion: 5.0.2
elementType: O O O N C C C C C C C C C C C C C C C C C C C C C C C C H H H H H H H H H H H H H H H H H H H H H H H H H
charge: 0
multiplicity: 1
keywords: wb97x-d3
keywords: def2-TZVPP
keywords: def2/J RIJCOSX
keywords: DEFGRID2
keywords: scfconv7
keywords: smallprint printgap noloewdin
keywords: NOSOSCF
formula: C24H25NO3
InChI: InChI=1/C24H25NO3/c1-16(2)13-20-22(24(20,3)4)23(26)28-21(15-25)17-9-8-12-19(14-17)27-18-10-6-5-7-11-18/h5-14,20-22H,1-4H3
53 atoms
O  -1.072083 1.367192 -0.346989
O  -0.964724 3.28198 0.791191
O  -1.409685 -3.667314 -0.795211
N  -2.09052 0.870372 2.871929
C  1.600858 3.888953 -0.915978
C  2.035858 3.05798 0.239654
C  0.860691 2.597476 -0.617848
C  0.957219 5.229666 -0.658938
C  2.422813 3.861237 -2.183266
C  3.28232 2.249462 0.237376
C  -0.459325 2.511903 0.013385
C  3.37609 1.008141 0.721825
C  2.215332 0.270356 1.321316
C  4.661884 0.242196 0.668507
C  -2.30684 1.052197 0.268432
C  -2.748335 -0.30024 -0.237664
C  -2.159435 0.981669 1.73045
C  -1.824827 -1.340617 -0.285195
C  -4.06893 -0.50261 -0.60082
C  -2.24141 -2.595858 -0.700778
C  -4.47024 -1.767029 -1.016327
C  -3.567985 -2.812894 -1.067501
C  -0.142247 -3.593791 -0.267239
C  0.046273 -3.605268 1.108003
C  0.935685 -3.557363 -1.136765
C  1.337776 -3.579681 1.613215
C  2.224402 -3.540334 -0.618806
C  2.429005 -3.547418 0.753705
H  1.735175 3.450475 1.20921
H  1.079805 1.778062 -1.29245
H  0.474709 5.29673 0.313101
H  1.720024 6.010022 -0.697538
H  0.213165 5.463158 -1.422923
H  1.809142 4.135517 -3.043432
H  3.244387 4.57797 -2.123236
H  2.852533 2.879667 -2.384625
H  4.169525 2.716383 -0.181893
H  1.782405 -0.428797 0.599392
H  2.539433 -0.328154 2.175061
H  1.418091 0.92681 1.666669
H  5.456956 0.801475 0.17539
H  5.005109 -0.021445 1.672251
H  4.528858 -0.70146 0.131527
H  -3.065679 1.808833 0.045759
H  -0.795667 -1.166817 0.003054
H  -4.780306 0.312303 -0.56009
H  -5.499594 -1.937779 -1.3026
H  -3.882229 -3.797349 -1.390922
H  -0.805218 -3.638065 1.776734
H  0.769038 -3.550117 -2.20672
H  1.489995 -3.588544 2.684718
H  3.069636 -3.517258 -1.294488
H  3.434539 -3.529744 1.153294
elementType: O N C H
totalener: -1210.10439592 hartree
nucrepener: 2564.43539818 hartree
electener: -3774.53979409 hartree
oneelecener: -6740.28868068 hartree
twoeener: 2965.74888659 hartree
cpcmener: -0.03118565 hartree
kineticenergy: 1204.70837235 hartree
xcener: -118.583547165044 hartree
chargesum: -0.0000000
charge: -0.283213 -0.445866 -0.323253 -0.092760 0.159676 -0.004389 -0.108390 -0.283755 -0.284098 -0.300510 0.372669 0.019476 -0.265174 -0.230814 0.407518 -0.007863 -0.234816 -0.180849 -0.217880 0.279244 -0.099433 -0.244101 0.241386 -0.176567 -0.188336 -0.144826 -0.131061 -0.181774 0.110102 0.092583 0.094600 0.093556 0.099468 0.098467 0.099599 0.093197 0.120647 0.086465 0.109259 0.094854 0.091287 0.097129 0.087727 0.134038 0.123406 0.144247 0.157212 0.145370 0.154405 0.147980 0.158472 0.156938 0.158751
qa: -0.2832 -0.4459 -0.3233 -0.0928 0.1597 -0.0044 -0.1084 -0.2838 -0.2841 -0.3005 0.3727 0.0195 -0.2652 -0.2308 0.4075 -0.0079 -0.2348 -0.1808 -0.2179 0.2792 -0.0994 -0.2441 0.2414 -0.1766 -0.1883 -0.1448 -0.1311 -0.1818 0.1101 0.0926 0.0946 0.0936 0.0995 0.0985 0.0996 0.0932 0.1206 0.0865 0.1093 0.0949 0.0913 0.0971 0.0877 0.1340 0.1234 0.1442 0.1572 0.1454 0.1544 0.1480 0.1585 0.1569 0.1588
va: 2.1373 2.0553 2.0907 3.1061 3.7098 3.8173 3.8387 3.8880 3.9080 3.8966 4.1594 3.6531 3.9586 3.9355 3.7635 3.7686 4.0175 3.9287 3.9663 3.7630 3.9028 4.0025 3.7217 3.9375 3.9903 3.8431 3.8508 3.8441 1.0197 1.0299 1.0187 1.0011 0.9993 1.0030 1.0002 1.0019 1.0040 0.9955 0.9979 1.0136 1.0079 0.9967 0.9979 1.0162 1.0296 1.0038 0.9893 1.0081 0.9978 1.0035 0.9910 0.9904 0.9912
dispcorr: -0.029118684 hartree
energy: -1210.133514598694
dipole: 26.38705 -25.47929 0.90776 13.33278 -13.85388 -0.52110 -4.68776 2.64539 -2.04236
magnitude: 2.29495 au
magnitude: 5.83331 debye
