program: Orca
programVersion: 5.0.2
elementType: O O O N C C C C C C C C C C C C C C C C C C C C C C C C H H H H H H H H H H H H H H H H H H H H H H H H H
charge: 0
multiplicity: 1
keywords: wb97x-d3
keywords: def2-TZVPP
keywords: def2/J RIJCOSX
keywords: DEFGRID2
keywords: scfconv7
keywords: smallprint printgap noloewdin
keywords: NOSOSCF
formula: C24H25NO3
InChI: InChI=1/C24H25NO3/c1-16(2)13-20-22(24(20,3)4)23(26)28-21(15-25)17-9-8-12-19(14-17)27-18-10-6-5-7-11-18/h5-14,20-22H,1-4H3
53 atoms
O  -0.730481 0.945621 1.264345
O  -0.627195 2.094681 -0.6482
O  -1.857338 -3.345508 -1.316338
N  -3.016078 0.143233 3.49377
C  2.318111 0.904638 -0.585801
C  2.326898 2.366351 -0.29495
C  1.388656 1.46032 0.486704
C  1.760153 0.432787 -1.905943
C  3.429976 0.023843 -0.069404
C  3.446339 3.052907 0.391428
C  -0.059561 1.558871 0.269121
C  3.439568 4.332857 0.775283
C  2.26572 5.247519 0.607926
C  4.63807 4.956146 1.422643
C  -2.142402 0.914155 1.153917
C  -2.64086 -0.058109 0.10593
C  -2.615837 0.490903 2.474804
C  -1.954312 -1.248006 -0.110461
C  -3.804191 0.231046 -0.587394
C  -2.451231 -2.154456 -1.036857
C  -4.291923 -0.690483 -1.505298
C  -3.62354 -1.878446 -1.735689
C  -0.625447 -3.627126 -0.773143
C  0.51107 -3.36592 -1.5218
C  -0.53905 -4.197674 0.48776
C  1.756376 -3.680955 -0.995183
C  0.711515 -4.504779 1.005647
C  1.859753 -4.244136 0.26954
H  1.812416 2.96455 -1.041465
H  1.676242 1.220177 1.504008
H  1.28816 -0.546671 -1.804991
H  1.029507 1.116063 -2.334383
H  2.571753 0.332504 -2.629412
H  3.089144 -1.011221 0.000176
H  4.284675 0.044025 -0.748783
H  3.782039 0.315936 0.919644
H  4.343706 2.469971 0.575709
H  1.392538 4.762727 0.174179
H  1.965482 5.66124 1.574382
H  2.524315 6.102446 -0.022779
H  5.463286 4.251804 1.528556
H  4.997506 5.810037 0.841887
H  4.393018 5.341625 2.415963
H  -2.55019 1.912645 0.962516
H  -1.049433 -1.461556 0.443732
H  -4.327401 1.163497 -0.416066
H  -5.19928 -0.475578 -2.054317
H  -4.000792 -2.593457 -2.456053
H  0.421819 -2.929146 -2.508643
H  -1.437776 -4.39926 1.057413
H  2.6470 -3.482696 -1.577324
H  0.78608 -4.948284 1.989989
H  2.832401 -4.484872 0.678227
elementType: O N C H
totalener: -1210.10583366 hartree
nucrepener: 2546.10590549 hartree
electener: -3756.21173915 hartree
oneelecener: -6703.55651611 hartree
twoeener: 2947.34477696 hartree
cpcmener: -0.03026795 hartree
kineticenergy: 1204.71175505 hartree
xcener: -118.584488550218 hartree
chargesum: -0.0000000
charge: -0.290086 -0.446709 -0.328758 -0.088499 0.159878 -0.060441 -0.050825 -0.260518 -0.297994 -0.260187 0.362603 -0.017457 -0.250295 -0.232249 0.398038 0.007084 -0.229143 -0.218563 -0.226900 0.304938 -0.101582 -0.237934 0.260674 -0.197763 -0.181148 -0.183779 -0.149412 -0.135185 0.103488 0.093244 0.080174 0.097688 0.101357 0.092537 0.105078 0.090953 0.122858 0.080782 0.095564 0.097366 0.088353 0.094674 0.094287 0.146193 0.134633 0.142373 0.157039 0.145475 0.154967 0.150849 0.161985 0.159488 0.160808
qa: -0.2901 -0.4467 -0.3288 -0.0885 0.1599 -0.0604 -0.0508 -0.2605 -0.2980 -0.2602 0.3626 -0.0175 -0.2503 -0.2322 0.3980 0.0071 -0.2291 -0.2186 -0.2269 0.3049 -0.1016 -0.2379 0.2607 -0.1978 -0.1811 -0.1838 -0.1494 -0.1352 0.1035 0.0932 0.0802 0.0977 0.1014 0.0925 0.1051 0.0910 0.1229 0.0808 0.0956 0.0974 0.0884 0.0947 0.0943 0.1462 0.1346 0.1424 0.1570 0.1455 0.1550 0.1508 0.1620 0.1595 0.1608
va: 2.1104 2.0594 2.0912 3.1137 3.7326 3.8544 3.8024 3.8762 3.9234 3.8879 4.1866 3.7152 3.9451 3.9307 3.7267 3.6757 4.0777 3.9163 4.0050 3.7305 3.8969 4.0014 3.6914 3.9421 3.9563 3.8601 3.8936 3.8519 1.0203 1.0331 1.0070 1.0188 1.0021 1.0069 0.9982 1.0034 1.0055 1.0161 0.9978 0.9981 1.0074 0.9955 0.9961 1.0175 1.0301 1.0030 0.9891 1.0078 0.9977 1.0009 0.9891 0.9895 0.9886
dispcorr: -0.028008120 hartree
energy: -1210.133841781614
dipole: 30.60955 -28.94586 1.66370 17.93735 -17.68792 0.24943 -3.65882 2.78404 -0.87478
magnitude: 1.89614 au
magnitude: 4.81960 debye
