program: Orca
programVersion: 5.0.2
elementType: O O O N C C C C C C C C C C C C C C C C C C C C C C C C H H H H H H H H H H H H H H H H H H H H H H H H H
charge: 0
multiplicity: 1
keywords: wb97x-d3
keywords: def2-TZVPP
keywords: def2/J RIJCOSX
keywords: DEFGRID2
keywords: scfconv7
keywords: smallprint printgap noloewdin
keywords: NOSOSCF
formula: C24H25NO3
InChI: InChI=1/C24H25NO3/c1-16(2)13-20-22(24(20,3)4)23(26)28-21(15-25)17-9-8-12-19(14-17)27-18-10-6-5-7-11-18/h5-14,20-22H,1-4H3
53 atoms
O  -0.591032 1.413439 1.402158
O  -0.864694 2.552232 -0.498998
O  0.086266 -2.927391 -0.96115
N  -2.594127 -0.036084 3.596638
C  2.280565 2.319137 -0.542334
C  1.888337 3.697558 -0.135953
C  1.273533 2.517745 0.587493
C  1.82962 1.786015 -1.879843
C  3.621034 1.777515 -0.10967
C  2.824763 4.599409 0.584792
C  -0.145679 2.200067 0.401041
C  2.503986 5.391445 1.611082
C  1.129282 5.471934 2.200252
C  3.52731 6.268424 2.265721
C  -1.904212 0.901628 1.2575
C  -1.974741 -0.198889 0.221869
C  -2.268128 0.382313 2.577988
C  -0.92982 -1.107437 0.110235
C  -3.088816 -0.303249 -0.596443
C  -0.999273 -2.109096 -0.844681
C  -3.150581 -1.321829 -1.537072
C  -2.109123 -2.22471 -1.674392
C  -0.090827 -4.267749 -1.179761
C  -1.052264 -5.002585 -0.496742
C  0.772931 -4.884705 -2.072682
C  -1.147934 -6.367388 -0.725338
C  0.672782 -6.252798 -2.282243
C  -0.290173 -6.998165 -1.6166
H  1.207179 4.190005 -0.827015
H  1.655439 2.305798 1.579637
H  2.622706 1.93333 -2.615585
H  1.626362 0.714114 -1.831416
H  0.940393 2.281877 -2.262485
H  4.403237 2.086232 -0.806421
H  3.910236 2.114953 0.885665
H  3.605913 0.686035 -0.097168
H  3.84793 4.619674 0.218888
H  0.384205 4.908693 1.642152
H  1.126383 5.104206 3.229926
H  0.793061 6.510765 2.245586
H  3.243818 7.322021 2.199264
H  3.612661 6.039913 3.3315
H  4.514665 6.155966 1.818026
H  -2.619711 1.69294 1.010881
H  -0.057098 -1.043933 0.749058
H  -3.899346 0.409122 -0.508401
H  -4.012713 -1.404418 -2.185252
H  -2.160735 -3.001526 -2.426733
H  -1.717569 -4.523693 0.210992
H  1.519628 -4.298686 -2.593784
H  -1.896968 -6.940634 -0.194577
H  1.348248 -6.733846 -2.977722
H  -0.37032 -8.063454 -1.78792
elementType: O N C H
totalener: -1210.10559684 hartree
nucrepener: 2456.43719415 hartree
electener: -3666.54279099 hartree
oneelecener: -6524.32310854 hartree
twoeener: 2857.78031755 hartree
cpcmener: -0.02964685 hartree
kineticenergy: 1204.72337070 hartree
xcener: -118.584987821135 hartree
chargesum: 0.0000000
charge: -0.288678 -0.443736 -0.332141 -0.088217 0.146433 -0.000257 -0.106627 -0.278494 -0.284328 -0.298565 0.358856 -0.015393 -0.238595 -0.226720 0.412014 0.033867 -0.230672 -0.236458 -0.200347 0.232619 -0.128251 -0.167595 0.255120 -0.171695 -0.236501 -0.154552 -0.129390 -0.175645 0.107529 0.099434 0.097575 0.097065 0.094804 0.099074 0.093413 0.098493 0.120938 0.083114 0.100095 0.101417 0.096248 0.093568 0.089112 0.142481 0.134327 0.145154 0.160521 0.159934 0.157715 0.146632 0.159390 0.157895 0.158023
qa: -0.2887 -0.4437 -0.3321 -0.0882 0.1464 -0.0003 -0.1066 -0.2785 -0.2843 -0.2986 0.3589 -0.0154 -0.2386 -0.2267 0.4120 0.0339 -0.2307 -0.2365 -0.2003 0.2326 -0.1283 -0.1676 0.2551 -0.1717 -0.2365 -0.1546 -0.1294 -0.1756 0.1075 0.0994 0.0976 0.0971 0.0948 0.0991 0.0934 0.0985 0.1209 0.0831 0.1001 0.1014 0.0962 0.0936 0.0891 0.1425 0.1343 0.1452 0.1605 0.1599 0.1577 0.1466 0.1594 0.1579 0.1580
va: 2.1022 2.0652 2.0558 3.1138 3.7056 3.8100 3.8125 3.8948 3.9068 3.8941 4.1788 3.7155 3.9333 3.9312 3.7090 3.6135 4.0800 4.0396 3.9947 3.7679 3.9002 3.9199 3.7179 3.8922 4.0025 3.8964 3.8943 3.8961 1.0224 1.0286 1.0020 0.9997 1.0163 1.0001 1.0028 1.0031 1.0040 1.0122 0.9988 0.9999 0.9965 0.9969 1.0064 1.0179 1.0298 1.0027 0.9904 0.9935 0.9969 1.0076 0.9906 0.9893 0.9904
dispcorr: -0.025911678 hartree
energy: -1210.131508521466
dipole: 21.90218 -21.17725 0.72493 21.99203 -21.95496 0.03707 -1.90643 0.67896 -1.22746
magnitude: 1.42603 au
magnitude: 3.62468 debye
