program: Orca
programVersion: 5.0.2
elementType: O O O N C C C C C C C C C C C C C C C C C C C C C C C C H H H H H H H H H H H H H H H H H H H H H H H H H
charge: 0
multiplicity: 1
keywords: wb97x-d3
keywords: def2-TZVPP
keywords: def2/J RIJCOSX
keywords: DEFGRID2
keywords: scfconv7
keywords: smallprint printgap noloewdin
keywords: NOSOSCF
formula: C24H25NO3
InChI: InChI=1/C24H25NO3/c1-16(2)13-20-22(24(20,3)4)23(26)28-21(15-25)17-9-8-12-19(14-17)27-18-10-6-5-7-11-18/h5-14,20-22H,1-4H3
53 atoms
O  -0.580048 1.407526 1.396794
O  -0.86113 2.550142 -0.500955
O  0.085365 -2.935314 -0.971106
N  -2.576107 -0.041609 3.597793
C  2.285754 2.340472 -0.547039
C  1.884295 3.713407 -0.13142
C  1.277911 2.524364 0.584457
C  1.837826 1.812976 -1.887834
C  3.630307 1.805636 -0.118523
C  2.814935 4.616517 0.595257
C  -0.139719 2.199636 0.397805
C  2.489019 5.401788 1.625149
C  1.11333 5.472729 2.213136
C  3.5073 6.280529 2.285268
C  -1.893439 0.895461 1.256225
C  -1.9687 -0.205789 0.22169
C  -2.253218 0.376632 2.578095
C  -0.923189 -1.112749 0.103159
C  -3.089713 -0.314006 -0.586713
C  -0.999791 -2.117508 -0.848063
C  -3.158213 -1.33528 -1.523879
C  -2.116811 -2.237262 -1.667477
C  -0.09332 -4.275989 -1.187167
C  -1.044796 -5.011244 -0.490734
C  0.758659 -4.892753 -2.091409
C  -1.142479 -6.376256 -0.717164
C  0.656717 -6.261072 -2.298853
C  -0.296275 -7.006903 -1.619559
H  1.199394 4.205898 -0.818756
H  1.66195 2.308868 1.5750
H  0.94549 2.305833 -2.267098
H  2.629819 1.969809 -2.622801
H  1.640895 0.73958 -1.84589
H  3.917296 2.138109 0.879156
H  3.623174 0.713996 -0.113718
H  4.410122 2.124975 -0.813197
H  3.838505 4.643783 0.23095
H  0.770438 6.509362 2.25954
H  0.372397 4.90537 1.653639
H  1.111902 5.103688 3.242353
H  3.592416 6.047311 3.350039
H  4.495736 6.174942 1.838297
H  3.218851 7.333078 2.223495
H  -2.609661 1.686804 1.011824
H  -0.045251 -1.046491 0.734476
H  -3.900699 0.397172 -0.493399
H  -4.025949 -1.421096 -2.164109
H  -2.174214 -3.016698 -2.416675
H  -1.700923 -4.532365 0.225575
H  1.497734 -4.306477 -2.622989
H  -1.883777 -6.949809 -0.175954
H  1.32303 -6.741947 -3.003255
H  -0.377861 -8.072367 -1.789182
elementType: O N C H
totalener: -1210.10564558 hartree
nucrepener: 2455.03961318 hartree
electener: -3665.14525875 hartree
oneelecener: -6521.53075165 hartree
twoeener: 2856.38549289 hartree
cpcmener: -0.02966310 hartree
kineticenergy: 1204.72216229 hartree
xcener: -118.584745921466 hartree
chargesum: -0.0000000
charge: -0.288841 -0.444106 -0.331868 -0.088236 0.145997 -0.000535 -0.106983 -0.278139 -0.284419 -0.298047 0.359956 -0.015635 -0.238639 -0.226652 0.411634 0.034046 -0.230525 -0.236103 -0.200231 0.231880 -0.128845 -0.167313 0.254149 -0.171174 -0.236063 -0.154429 -0.129400 -0.175329 0.107532 0.099353 0.094690 0.097417 0.097350 0.093506 0.098528 0.099062 0.120944 0.101467 0.083155 0.099999 0.093560 0.089086 0.096257 0.142557 0.134113 0.145126 0.160561 0.159900 0.157808 0.146612 0.159337 0.157904 0.158027
qa: -0.2888 -0.4441 -0.3319 -0.0882 0.1460 -0.0005 -0.1070 -0.2781 -0.2844 -0.2980 0.3600 -0.0156 -0.2386 -0.2267 0.4116 0.0340 -0.2305 -0.2361 -0.2002 0.2319 -0.1288 -0.1673 0.2541 -0.1712 -0.2361 -0.1544 -0.1294 -0.1753 0.1075 0.0994 0.0947 0.0974 0.0973 0.0935 0.0985 0.0991 0.1209 0.1015 0.0832 0.1000 0.0936 0.0891 0.0963 0.1426 0.1341 0.1451 0.1606 0.1599 0.1578 0.1466 0.1593 0.1579 0.1580
va: 2.1022 2.0648 2.0567 3.1138 3.7059 3.8104 3.8133 3.8947 3.9070 3.8939 4.1766 3.7155 3.9333 3.9311 3.7091 3.6143 4.0797 4.0390 3.9947 3.7706 3.9009 3.9191 3.7185 3.8925 4.0027 3.8962 3.8942 3.8958 1.0224 1.0286 1.0163 1.0020 0.9996 1.0027 1.0031 1.0001 1.0040 0.9998 1.0122 0.9988 0.9969 1.0064 0.9965 1.0180 1.0299 1.0027 0.9904 0.9935 0.9968 1.0076 0.9906 0.9893 0.9904
dispcorr: -0.025866862 hartree
energy: -1210.131512439955
dipole: 21.81551 -21.09788 0.71763 22.13487 -22.09461 0.04025 -1.84411 0.62314 -1.22098
magnitude: 1.41683 au
magnitude: 3.60128 debye
