program: Orca
programVersion: 5.0.2
elementType: O O O N C C C C C C C C C C C C C C C C C C C C C C C C H H H H H H H H H H H H H H H H H H H H H H H H H
charge: 0
multiplicity: 1
keywords: wb97x-d3
keywords: def2-TZVPP
keywords: def2/J RIJCOSX
keywords: DEFGRID2
keywords: scfconv7
keywords: smallprint printgap noloewdin
keywords: NOSOSCF
formula: C24H25NO3
InChI: InChI=1/C24H25NO3/c1-16(2)13-20-22(24(20,3)4)23(26)28-21(15-25)17-9-8-12-19(14-17)27-18-10-6-5-7-11-18/h5-14,20-22H,1-4H3
53 atoms
O  -1.365603 2.00013 0.094036
O  0.369162 0.812678 0.839067
O  -1.464232 -3.887191 -1.065344
N  -2.437336 0.05395 2.653752
C  1.723708 3.626482 1.136117
C  2.155141 3.047055 -0.174555
C  0.673114 3.099891 0.1711
C  2.057257 2.871222 2.399468
C  1.732383 5.123933 1.330224
C  2.651681 3.88094 -1.287524
C  -0.062868 1.854178 0.416172
C  3.736385 3.653025 -2.035666
C  4.661001 2.485455 -1.876471
C  4.12058 4.601807 -3.132127
C  -2.186911 0.849223 0.174167
C  -1.77251 -0.244685 -0.791302
C  -2.290761 0.390333 1.565248
C  -1.800299 -1.581774 -0.421562
C  -1.401419 0.120526 -2.080158
C  -1.43077 -2.554947 -1.343026
C  -1.03691 -0.86241 -2.987325
C  -1.040607 -2.199557 -2.626801
C  -1.356118 -4.339423 0.224869
C  -0.308727 -3.946042 1.048463
C  -2.297491 -5.2590 0.661325
C  -0.217607 -4.478552 2.325932
C  -2.186717 -5.793124 1.937839
C  -1.152707 -5.401754 2.776032
H  2.588769 2.055952 -0.094648
H  0.097264 3.865493 -0.336847
H  2.990465 3.258348 2.813519
H  1.282895 3.007393 3.157231
H  2.191998 1.803564 2.243431
H  1.075485 5.403455 2.15606
H  2.738334 5.470445 1.575967
H  1.39965 5.671813 0.449529
H  2.069116 4.770135 -1.510793
H  4.376235 1.79825 -1.081376
H  4.719131 1.912818 -2.806381
H  5.677348 2.830755 -1.665439
H  5.126569 4.999329 -2.972466
H  4.141073 4.095755 -4.101254
H  3.435274 5.44608 -3.20896
H  -3.181811 1.209746 -0.102225
H  -2.103509 -1.869169 0.57746
H  -1.387536 1.159279 -2.383505
H  -0.739182 -0.582589 -3.989296
H  -0.748449 -2.965029 -3.33451
H  0.430445 -3.234493 0.701159
H  -3.105603 -5.558052 0.005468
H  0.596198 -4.172082 2.970348
H  -2.919589 -6.513524 2.27766
H  -1.072915 -5.816246 3.772381
elementType: O N C H
totalener: -1210.10561481 hartree
nucrepener: 2474.47264363 hartree
electener: -3684.57825844 hartree
oneelecener: -6561.26676672 hartree
twoeener: 2876.68850828 hartree
cpcmener: -0.03212489 hartree
kineticenergy: 1204.69690800 hartree
xcener: -118.584864024515 hartree
chargesum: 0.0000000
charge: -0.294875 -0.444863 -0.324562 -0.079925 0.107291 0.040857 -0.091685 -0.276195 -0.269018 -0.274291 0.394863 -0.048888 -0.248222 -0.217611 0.528122 -0.051491 -0.263570 -0.182091 -0.282752 0.291211 -0.099363 -0.248353 0.272452 -0.192273 -0.235428 -0.139358 -0.126357 -0.176943 0.099107 0.086988 0.095916 0.099578 0.093734 0.098497 0.098359 0.088070 0.116582 0.088783 0.095220 0.095387 0.093054 0.093489 0.087730 0.145327 0.132130 0.143736 0.157329 0.146136 0.157919 0.145610 0.159467 0.157196 0.157973
qa: -0.2949 -0.4449 -0.3246 -0.0799 0.1073 0.0409 -0.0917 -0.2762 -0.2690 -0.2743 0.3949 -0.0489 -0.2482 -0.2176 0.5281 -0.0515 -0.2636 -0.1821 -0.2828 0.2912 -0.0994 -0.2484 0.2725 -0.1923 -0.2354 -0.1394 -0.1264 -0.1769 0.0991 0.0870 0.0959 0.0996 0.0937 0.0985 0.0984 0.0881 0.1166 0.0888 0.0952 0.0954 0.0931 0.0935 0.0877 0.1453 0.1321 0.1437 0.1573 0.1461 0.1579 0.1456 0.1595 0.1572 0.1580
va: 2.1244 2.0612 2.0852 3.1035 3.7011 3.7820 3.8696 3.9046 3.9085 3.8754 4.1311 3.7666 3.9418 3.9209 3.7856 3.7623 4.1123 3.8872 4.0032 3.7817 3.9006 4.0157 3.6950 3.9279 4.0113 3.8861 3.8834 3.9013 1.0271 1.0388 0.9999 0.9998 1.0194 1.0018 1.0017 1.0065 1.0112 1.0113 0.9970 0.9975 0.9965 0.9963 1.0090 0.9872 1.0196 1.0116 0.9895 1.0075 0.9974 1.0073 0.9899 0.9895 0.9904
dispcorr: -0.025125243 hartree
energy: -1210.130740054402
dipole: 28.28976 -27.75767 0.53208 26.35165 -24.85284 1.49881 -4.51167 2.84162 -1.67005
magnitude: 2.30621 au
magnitude: 5.86192 debye
