program: Orca
programVersion: 5.0.2
elementType: O O O N C C C C C C C C C C C C C C C C C C C C C C C C H H H H H H H H H H H H H H H H H H H H H H H H H
charge: 0
multiplicity: 1
keywords: wb97x-d3
keywords: def2-TZVPP
keywords: def2/J RIJCOSX
keywords: DEFGRID2
keywords: scfconv7
keywords: smallprint printgap noloewdin
keywords: NOSOSCF
formula: C24H25NO3
InChI: InChI=1/C24H25NO3/c1-16(2)13-20-22(24(20,3)4)23(26)28-21(15-25)17-9-8-12-19(14-17)27-18-10-6-5-7-11-18/h5-14,20-22H,1-4H3
53 atoms
O  -0.572459 1.412214 1.366197
O  -0.857824 2.574429 -0.519296
O  0.0590 -2.941753 -0.965491
N  -2.57872 0.029967 3.596567
C  2.287471 2.381186 -0.590648
C  1.890341 3.738674 -0.125235
C  1.287581 2.524862 0.553499
C  1.831431 1.901932 -1.946785
C  3.634364 1.829924 -0.190514
C  2.825079 4.614123 0.629803
C  -0.132045 2.207705 0.369463
C  2.499138 5.370714 1.680909
C  1.12026 5.432284 2.262648
C  3.520076 6.219518 2.375049
C  -1.891972 0.914701 1.235498
C  -1.982766 -0.202981 0.219581
C  -2.255973 0.420969 2.565769
C  -0.935971 -1.106803 0.093273
C  -3.123147 -0.333164 -0.558564
C  -1.030212 -2.131659 -0.835309
C  -3.20892 -1.373926 -1.472422
C  -2.166587 -2.274006 -1.623846
C  -0.101821 -4.283241 -1.18836
C  -1.04457 -5.036835 -0.499586
C  0.764931 -4.882405 -2.090814
C  -1.118044 -6.402646 -0.732077
C  0.687604 -6.251501 -2.303794
C  -0.256136 -7.015794 -1.631972
H  1.20084 4.255022 -0.790164
H  1.679527 2.277983 1.533518
H  0.930452 2.40043 -2.298006
H  2.615336 2.095757 -2.682221
H  1.645238 0.825571 -1.944212
H  3.625306 0.738671 -0.223619
H  4.40939 2.172096 -0.879914
H  3.930362 2.12677 0.815985
H  3.851071 4.643063 0.272422
H  0.374607 4.908931 1.666821
H  1.105079 5.005263 3.269567
H  0.793579 6.470274 2.365288
H  4.511484 6.117102 1.93379
H  3.242686 7.276344 2.342153
H  3.593397 5.95386 3.43319
H  -2.598984 1.710783 0.979253
H  -0.043062 -1.02395 0.701109
H  -3.935883 0.375294 -0.459586
H  -4.092345 -1.47789 -2.088252
H  -2.239796 -3.068976 -2.35512
H  -1.712417 -4.572148 0.215459
H  1.497328 -4.281706 -2.615557
H  -1.852746 -6.990699 -0.197232
H  1.366515 -6.71851 -3.005746
H  -0.318385 -8.082062 -1.805461
elementType: O N C H
totalener: -1210.10567226 hartree
nucrepener: 2451.65890144 hartree
electener: -3661.76457369 hartree
oneelecener: -6514.75412491 hartree
twoeener: 2852.98955122 hartree
cpcmener: -0.02958274 hartree
kineticenergy: 1204.70997007 hartree
xcener: -118.582568017438 hartree
chargesum: 0.0000000
charge: -0.289761 -0.445551 -0.330242 -0.088489 0.145956 -0.001600 -0.108210 -0.277256 -0.284681 -0.296644 0.363246 -0.015652 -0.239545 -0.225987 0.409819 0.034247 -0.230594 -0.233721 -0.203932 0.237663 -0.127334 -0.173455 0.262993 -0.178364 -0.239503 -0.152095 -0.127660 -0.177190 0.107516 0.098468 0.094848 0.097139 0.097481 0.098454 0.099107 0.093717 0.120976 0.083066 0.100811 0.101462 0.089032 0.096252 0.093504 0.142794 0.133616 0.145033 0.160392 0.159524 0.158189 0.146676 0.159422 0.157921 0.158142
qa: -0.2898 -0.4456 -0.3302 -0.0885 0.1460 -0.0016 -0.1082 -0.2773 -0.2847 -0.2966 0.3632 -0.0157 -0.2395 -0.2260 0.4098 0.0342 -0.2306 -0.2337 -0.2039 0.2377 -0.1273 -0.1735 0.2630 -0.1784 -0.2395 -0.1521 -0.1277 -0.1772 0.1075 0.0985 0.0948 0.0971 0.0975 0.0985 0.0991 0.0937 0.1210 0.0831 0.1008 0.1015 0.0890 0.0963 0.0935 0.1428 0.1336 0.1450 0.1604 0.1595 0.1582 0.1467 0.1594 0.1579 0.1581
va: 2.1008 2.0631 2.0630 3.1142 3.7073 3.8145 3.8144 3.8944 3.9075 3.8945 4.1703 3.7143 3.9339 3.9314 3.7115 3.6233 4.0778 4.0398 3.9973 3.7738 3.8994 3.9208 3.7110 3.8991 4.0043 3.8947 3.8926 3.8980 1.0222 1.0291 1.0167 1.0019 0.9996 1.0032 1.0000 1.0025 1.0038 1.0120 0.9985 1.0000 1.0065 0.9965 0.9968 1.0186 1.0303 1.0027 0.9905 0.9938 0.9966 1.0077 0.9905 0.9893 0.9904
dispcorr: -0.025713151 hartree
energy: -1210.131385408821
dipole: 21.90213 -21.16809 0.73404 22.00054 -22.01642 -0.01587 -1.74588 0.52363 -1.22225
magnitude: 1.42582 au
magnitude: 3.62414 debye
