program: Orca
programVersion: 5.0.2
elementType: O O O N C C C C C C C C C C C C C C C C C C C C C C C C H H H H H H H H H H H H H H H H H H H H H H H H H
charge: 0
multiplicity: 1
keywords: wb97x-d3
keywords: def2-TZVPP
keywords: def2/J RIJCOSX
keywords: DEFGRID2
keywords: scfconv7
keywords: smallprint printgap noloewdin
keywords: NOSOSCF
formula: C24H25NO3
InChI: InChI=1/C24H25NO3/c1-16(2)13-20-22(24(20,3)4)23(26)28-21(15-25)17-9-8-12-19(14-17)27-18-10-6-5-7-11-18/h5-14,20-22H,1-4H3
53 atoms
O  -0.303295 0.66431 1.104941
O  -0.946965 2.630973 0.258242
O  -1.77348 -3.246086 -2.122595
N  -1.690442 -1.437932 3.243197
C  1.949786 2.646114 -0.933108
C  1.946921 3.471953 0.316764
C  1.37945 2.060768 0.349437
C  1.036291 3.049847 -2.065452
C  3.239751 2.027627 -1.415853
C  3.173747 3.747662 1.089802
C  -0.062722 1.863227 0.542175
C  3.551789 4.91954 1.611306
C  2.783518 6.200609 1.497572
C  4.835535 5.030404 2.379316
C  -1.666893 0.296341 1.289492
C  -2.241456 -0.317073 0.03629
C  -1.660281 -0.670066 2.390056
C  -1.717299 -1.520685 -0.428704
C  -3.248959 0.334396 -0.65616
C  -2.221051 -2.075491 -1.59549
C  -3.738524 -0.230564 -1.827836
C  -3.233706 -1.427843 -2.300418
C  -0.913755 -4.023857 -1.380865
C  0.448054 -3.949823 -1.626535
C  -1.425534 -4.888795 -0.424625
C  1.310603 -4.760243 -0.900303
C  -0.553488 -5.692932 0.295371
C  0.814402 -5.628714 0.062392
H  1.190748 4.249844 0.32683
H  2.001662 1.309528 0.82328
H  1.5848 3.684229 -2.765996
H  0.687979 2.174648 -2.620266
H  0.163708 3.609963 -1.737019
H  3.033496 1.190677 -2.085677
H  3.826916 2.760476 -1.973182
H  3.863923 1.650953 -0.60667
H  3.829344 2.896743 1.249725
H  1.846899 6.108566 0.950913
H  2.551735 6.599434 2.488774
H  3.384021 6.963465 0.994599
H  5.508077 5.759582 1.9191
H  4.654551 5.380548 3.399321
H  5.364089 4.078873 2.441202
H  -2.270686 1.15176 1.608325
H  -0.926925 -2.01578 0.123317
H  -3.651542 1.269813 -0.290011
H  -4.525089 0.268444 -2.378687
H  -3.620848 -1.868748 -3.210611
H  0.828742 -3.268033 -2.377071
H  -2.493169 -4.935065 -0.247366
H  2.375472 -4.706667 -1.087025
H  -0.94677 -6.370423 1.042483
H  1.490922 -6.256513 0.627676
elementType: O N C H
totalener: -1210.10776017 hartree
nucrepener: 2457.76407985 hartree
electener: -3667.87184002 hartree
oneelecener: -6527.18809154 hartree
twoeener: 2859.31625153 hartree
cpcmener: -0.02968573 hartree
kineticenergy: 1204.69523424 hartree
xcener: -118.579683820398 hartree
chargesum: -0.0000000
charge: -0.285566 -0.453462 -0.326163 -0.089938 0.100102 0.041698 -0.096590 -0.276757 -0.268482 -0.272210 0.395117 -0.052438 -0.249147 -0.216510 0.421988 -0.010309 -0.236696 -0.201483 -0.204994 0.276149 -0.105404 -0.235452 0.218174 -0.175964 -0.165468 -0.155714 -0.156893 -0.147568 0.096701 0.090038 0.096390 0.099091 0.094841 0.097872 0.097840 0.088673 0.116341 0.088737 0.095377 0.096125 0.092955 0.092894 0.087469 0.136400 0.135789 0.143217 0.157780 0.146483 0.149472 0.153134 0.158705 0.158826 0.158827
qa: -0.2856 -0.4535 -0.3262 -0.0899 0.1001 0.0417 -0.0966 -0.2768 -0.2685 -0.2722 0.3951 -0.0524 -0.2491 -0.2165 0.4220 -0.0103 -0.2367 -0.2015 -0.2050 0.2761 -0.1054 -0.2355 0.2182 -0.1760 -0.1655 -0.1557 -0.1569 -0.1476 0.0967 0.0900 0.0964 0.0991 0.0948 0.0979 0.0978 0.0887 0.1163 0.0887 0.0954 0.0961 0.0930 0.0929 0.0875 0.1364 0.1358 0.1432 0.1578 0.1465 0.1495 0.1531 0.1587 0.1588 0.1588
va: 2.1296 2.0587 2.0882 3.1106 3.6944 3.7839 3.8499 3.9022 3.9104 3.8746 4.1782 3.7684 3.9406 3.9206 3.7291 3.6622 4.0802 3.9494 3.9601 3.7597 3.9050 4.0072 3.7493 3.9628 3.9577 3.8955 3.8988 3.8799 1.0280 1.0362 1.0003 0.9990 1.0185 1.0019 1.0017 1.0066 1.0115 1.0106 0.9970 0.9970 0.9963 0.9966 1.0092 1.0182 1.0225 1.0097 0.9892 1.0072 1.0023 0.9989 0.9901 0.9902 0.9899
dispcorr: -0.024707969 hartree
energy: -1210.132468136310
dipole: 27.64512 -26.52453 1.12058 28.58462 -27.85382 0.73080 -2.25933 1.21859 -1.04074
magnitude: 1.69497 au
magnitude: 4.30826 debye
