program: Orca
programVersion: 5.0.2
elementType: O O O N C C C C C C C C C C C C C C C C C C C C C C C C H H H H H H H H H H H H H H H H H H H H H H H H H
charge: 0
multiplicity: 1
keywords: wb97x-d3
keywords: def2-TZVPP
keywords: def2/J RIJCOSX
keywords: DEFGRID2
keywords: scfconv7
keywords: smallprint printgap noloewdin
keywords: NOSOSCF
formula: C24H25NO3
InChI: InChI=1/C24H25NO3/c1-16(2)13-20-22(24(20,3)4)23(26)28-21(15-25)17-9-8-12-19(14-17)27-18-10-6-5-7-11-18/h5-14,20-22H,1-4H3
53 atoms
O  -1.385811 1.574321 -1.235954
O  -1.079691 1.458046 0.972818
O  -1.390588 -3.426712 -0.520049
N  -3.988419 3.089769 0.328192
C  1.540399 3.057683 0.234628
C  1.897475 1.624677 0.471184
C  0.769524 1.95192 -0.479405
C  0.913009 3.839458 1.361112
C  2.42662 3.895702 -0.652232
C  3.13809 1.011757 -0.066981
C  -0.618552 1.63442 -0.125093
C  4.256027 0.820747 0.638595
C  4.406404 1.223983 2.07305
C  5.45642 0.158666 0.034306
C  -2.753604 1.259839 -1.076998
C  -3.011486 -0.14727 -0.570281
C  -3.422567 2.279512 -0.257196
C  -2.060282 -1.13304 -0.791456
C  -4.215106 -0.465188 0.046671
C  -2.29695 -2.423841 -0.337514
C  -4.453595 -1.769341 0.453278
C  -3.49416 -2.753279 0.280032
C  -0.052531 -3.185595 -0.358393
C  0.812764 -3.883466 -1.189013
C  0.439785 -2.331728 0.622819
C  2.182883 -3.721378 -1.039581
C  1.81187 -2.175013 0.75432
C  2.688998 -2.861227 -0.075178
H  1.569265 1.242303 1.433924
H  0.992305 1.859518 -1.536883
H  0.354697 3.219211 2.058646
H  1.698682 4.339331 1.931446
H  0.241524 4.613211 0.983463
H  3.267985 4.294878 -0.081831
H  2.834956 3.33348 -1.491593
H  1.870489 4.742597 -1.058955
H  3.119288 0.691319 -1.104737
H  3.554141 1.781986 2.457897
H  4.548501 0.346871 2.710744
H  5.295217 1.846199 2.206272
H  5.747087 -0.726378 0.606915
H  5.283554 -0.149845 -0.996806
H  6.321259 0.82772 0.046184
H  -3.172218 1.35642 -2.083277
H  -1.133125 -0.908051 -1.30375
H  -4.972147 0.289948 0.216608
H  -5.392091 -2.016704 0.931572
H  -3.668819 -3.765929 0.62071
H  0.414338 -4.550045 -1.943762
H  -0.22866 -1.792823 1.282669
H  2.854881 -4.267428 -1.689238
H  2.195401 -1.511778 1.518567
H  3.757674 -2.729344 0.033532
elementType: O N C H
totalener: -1210.10420758 hartree
nucrepener: 2593.62055328 hartree
electener: -3803.72476085 hartree
oneelecener: -6798.86412581 hartree
twoeener: 2995.13936495 hartree
cpcmener: -0.03161907 hartree
kineticenergy: 1204.70934963 hartree
xcener: -118.588662913327 hartree
chargesum: -0.0000000
charge: -0.294265 -0.436251 -0.328454 -0.085891 0.157809 -0.050691 -0.080974 -0.294023 -0.270269 -0.273285 0.381687 -0.020396 -0.256459 -0.248163 0.501863 -0.012215 -0.252542 -0.247442 -0.215314 0.283007 -0.110163 -0.242060 0.309903 -0.259022 -0.209448 -0.116168 -0.133419 -0.197382 0.101369 0.091267 0.095225 0.096757 0.102315 0.097205 0.092080 0.100374 0.123884 0.089899 0.098710 0.101172 0.093805 0.093575 0.105602 0.148637 0.149193 0.135237 0.159055 0.147128 0.144923 0.151213 0.156388 0.163040 0.161974
qa: -0.2943 -0.4363 -0.3285 -0.0859 0.1578 -0.0507 -0.0810 -0.2940 -0.2703 -0.2733 0.3817 -0.0204 -0.2565 -0.2482 0.5019 -0.0122 -0.2525 -0.2474 -0.2153 0.2830 -0.1102 -0.2421 0.3099 -0.2590 -0.2094 -0.1162 -0.1334 -0.1974 0.1014 0.0913 0.0952 0.0968 0.1023 0.0972 0.0921 0.1004 0.1239 0.0899 0.0987 0.1012 0.0938 0.0936 0.1056 0.1486 0.1492 0.1352 0.1591 0.1471 0.1449 0.1512 0.1564 0.1630 0.1620
va: 2.1274 2.0634 2.0884 3.1027 3.7566 3.7654 3.8744 3.9011 3.9053 3.8188 4.1667 3.6706 3.9442 3.9234 3.7746 3.7252 4.0975 3.9564 3.9733 3.7358 3.9097 4.0322 3.6705 4.0177 3.8936 3.9025 3.8465 3.8998 1.0192 1.0396 1.0178 1.0007 1.0007 1.0021 1.0020 1.0032 1.0085 1.0069 0.9980 0.9988 0.9938 1.0062 0.9987 0.9871 1.0141 1.0142 0.9897 1.0054 1.0085 1.0058 0.9895 0.9821 0.9869
dispcorr: -0.030086297 hartree
energy: -1210.134293873435
dipole: 35.18487 -33.30676 1.87811 11.59540 -12.22073 -0.62533 5.55414 -6.81283 -1.25869
magnitude: 2.34577 au
magnitude: 5.96246 debye
