program: Orca
programVersion: 5.0.2
elementType: O O O N C C C C C C C C C C C C C C C C C C C C C C C C H H H H H H H H H H H H H H H H H H H H H H H H H
charge: 0
multiplicity: 1
keywords: wb97x-d3
keywords: def2-TZVPP
keywords: def2/J RIJCOSX
keywords: DEFGRID2
keywords: scfconv7
keywords: smallprint printgap noloewdin
keywords: NOSOSCF
formula: C24H25NO3
InChI: InChI=1/C24H25NO3/c1-16(2)13-20-22(24(20,3)4)23(26)28-21(15-25)17-9-8-12-19(14-17)27-18-10-6-5-7-11-18/h5-14,20-22H,1-4H3
53 atoms
O  -0.664444 1.696147 -0.133643
O  1.276107 0.594212 -0.258148
O  -2.116363 -4.108575 -0.00335
N  -3.36834 1.75631 -2.014357
C  2.225344 2.540958 1.990431
C  2.528487 3.221132 0.701754
C  1.12963 2.671607 0.941708
C  2.863621 1.205324 2.285585
C  2.014101 3.379922 3.228696
C  2.728818 4.69102 0.613866
C  0.647063 1.540577 0.141845
C  2.261453 5.480298 -0.356499
C  1.442963 4.983471 -1.508228
C  2.518291 6.956079 -0.348582
C  -1.302159 0.65576 -0.852822
C  -1.754916 -0.468303 0.052052
C  -2.457652 1.286841 -1.495239
C  -1.665878 -1.77536 -0.40201
C  -2.291627 -0.185854 1.303141
C  -2.11777 -2.809184 0.409599
C  -2.734016 -1.228954 2.10074
C  -2.646879 -2.542089 1.663393
C  -1.051527 -4.616372 -0.697877
C  -1.335954 -5.500869 -1.728362
C  0.262661 -4.320885 -0.35679
C  -0.292874 -6.101037 -2.418848
C  1.295049 -4.920493 -1.063903
C  1.025049 -5.811002 -2.094492
H  3.117013 2.624958 0.007409
H  0.371348 3.413837 1.162219
H  3.170049 0.667773 1.391525
H  3.758019 1.362148 2.891963
H  2.192394 0.560391 2.855962
H  2.970286 3.619014 3.698875
H  1.502669 4.319585 3.019089
H  1.41547 2.835014 3.961088
H  3.319962 5.142817 1.406137
H  1.866721 5.327758 -2.454991
H  1.371955 3.8985 -1.554384
H  0.426738 5.384831 -1.462907
H  3.065601 7.265873 -1.242703
H  1.578333 7.514725 -0.354412
H  3.09103 7.271227 0.52364
H  -0.660397 0.266383 -1.650267
H  -1.254293 -1.980338 -1.38348
H  -2.369744 0.833688 1.657464
H  -3.150002 -1.020212 3.077507
H  -2.991845 -3.356357 2.287975
H  -2.365626 -5.721767 -1.980656
H  0.48687 -3.638548 0.453805
H  -0.51599 -6.794595 -3.219278
H  2.319178 -4.692361 -0.798008
H  1.836018 -6.277999 -2.637598
elementType: O N C H
totalener: -1210.10504943 hartree
nucrepener: 2450.58682988 hartree
electener: -3660.69187931 hartree
oneelecener: -6512.44878046 hartree
twoeener: 2851.75690114 hartree
cpcmener: -0.02946675 hartree
kineticenergy: 1204.71219472 hartree
xcener: -118.582463828589 hartree
chargesum: -0.0000000
charge: -0.287820 -0.452364 -0.328289 -0.088764 0.148652 -0.006257 -0.117606 -0.283767 -0.285363 -0.291143 0.380703 -0.016538 -0.237512 -0.226500 0.391272 0.022553 -0.223944 -0.172501 -0.206162 0.241509 -0.137140 -0.210148 0.270560 -0.245575 -0.179895 -0.121362 -0.146599 -0.183900 0.109812 0.097417 0.094999 0.094329 0.100466 0.099293 0.094365 0.098181 0.121311 0.101985 0.082741 0.101103 0.096553 0.094126 0.089132 0.140701 0.145187 0.146812 0.158784 0.149878 0.146079 0.156489 0.157506 0.159057 0.157591
qa: -0.2878 -0.4524 -0.3283 -0.0888 0.1487 -0.0063 -0.1176 -0.2838 -0.2854 -0.2911 0.3807 -0.0165 -0.2375 -0.2265 0.3913 0.0226 -0.2239 -0.1725 -0.2062 0.2415 -0.1371 -0.2101 0.2706 -0.2456 -0.1799 -0.1214 -0.1466 -0.1839 0.1098 0.0974 0.0950 0.0943 0.1005 0.0993 0.0944 0.0982 0.1213 0.1020 0.0827 0.1011 0.0966 0.0941 0.0891 0.1407 0.1452 0.1468 0.1588 0.1499 0.1461 0.1565 0.1575 0.1591 0.1576
va: 2.0981 2.0588 2.0765 3.1139 3.7024 3.8211 3.8290 3.8906 3.9107 3.8905 4.1377 3.7142 3.9348 3.9312 3.7357 3.6445 4.0722 3.9620 3.9582 3.7593 3.9230 4.0006 3.7043 4.0063 3.9023 3.8859 3.8973 3.9037 1.0185 1.0292 1.0184 1.0011 0.9993 1.0002 1.0019 1.0031 1.0034 0.9993 1.0115 0.9988 0.9966 0.9965 1.0065 1.0243 1.0057 1.0126 0.9900 1.0040 1.0080 0.9978 0.9892 0.9904 0.9906
dispcorr: -0.025378418 hartree
energy: -1210.130427848217
dipole: 23.42967 -21.96446 1.46520 26.74273 -26.47472 0.26801 9.00893 -7.88227 1.12666
magnitude: 1.86762 au
magnitude: 4.74712 debye
