program: Orca
programVersion: 5.0.2
elementType: O O O N C C C C C C C C C C C C C C C C C C C C C C C C H H H H H H H H H H H H H H H H H H H H H H H H H
charge: 0
multiplicity: 1
keywords: wb97x-d3
keywords: def2-TZVPP
keywords: def2/J RIJCOSX
keywords: DEFGRID2
keywords: scfconv7
keywords: smallprint printgap noloewdin
keywords: NOSOSCF
formula: C24H25NO3
InChI: InChI=1/C24H25NO3/c1-16(2)13-20-22(24(20,3)4)23(26)28-21(15-25)17-9-8-12-19(14-17)27-18-10-6-5-7-11-18/h5-14,20-22H,1-4H3
53 atoms
O  -0.721937 1.239771 -0.12344
O  -0.811279 3.168889 0.995664
O  -1.515817 -3.6029 -1.579986
N  -1.757735 0.256528 2.936283
C  1.432953 3.903378 -1.16157
C  2.001224 3.74056 0.20331
C  1.103442 2.651487 -0.353349
C  0.376988 4.955358 -1.392134
C  2.314135 3.668708 -2.363882
C  3.435324 3.452882 0.459911
C  -0.215194 2.431613 0.250835
C  3.878908 2.757585 1.510413
C  2.960635 2.149451 2.527509
C  5.339415 2.510557 1.728796
C  -1.988387 0.883699 0.404612
C  -2.522608 -0.296757 -0.367213
C  -1.850684 0.548179 1.829145
C  -1.725068 -1.417167 -0.576008
C  -3.818783 -0.246929 -0.858062
C  -2.246093 -2.492875 -1.280999
C  -4.324198 -1.331019 -1.562279
C  -3.546254 -2.455258 -1.773399
C  -0.561977 -4.073285 -0.717013
C  0.632133 -4.508199 -1.273082
C  -0.791757 -4.181612 0.64911
C  1.606792 -5.056844 -0.45174
C  0.197287 -4.720179 1.459317
C  1.397574 -5.159324 0.916288
H  1.513171 4.348056 0.96245
H  1.591486 1.747973 -0.70108
H  -0.310598 4.655006 -2.185406
H  -0.209744 5.174989 -0.501987
H  0.851339 5.887847 -1.705134
H  1.711834 3.395959 -3.232484
H  2.865302 4.57652 -2.618602
H  3.041147 2.872279 -2.20471
H  4.157624 3.85519 -0.24471
H  3.370243 2.251262 3.534811
H  1.964177 2.58974 2.52701
H  2.843388 1.076543 2.347316
H  5.549062 1.439958 1.802964
H  5.952317 2.918774 0.924969
H  5.676025 2.955453 2.668935
H  -2.694953 1.715708 0.333401
H  -0.710418 -1.446252 -0.196891
H  -4.431013 0.630688 -0.694214
H  -5.334373 -1.299932 -1.94829
H  -3.937544 -3.302701 -2.322046
H  0.792587 -4.423014 -2.340627
H  -1.72925 -3.855817 1.082618
H  2.536462 -5.399689 -0.887306
H  0.020734 -4.802983 2.523963
H  2.161832 -5.582481 1.554719
elementType: O N C H
totalener: -1210.10664648 hartree
nucrepener: 2461.33692805 hartree
electener: -3671.44357453 hartree
oneelecener: -6534.21089357 hartree
twoeener: 2862.76731904 hartree
cpcmener: -0.03028098 hartree
kineticenergy: 1204.70725157 hartree
xcener: -118.581461361455 hartree
chargesum: -0.0000000
charge: -0.288292 -0.452002 -0.325732 -0.092891 0.147527 -0.025688 -0.082492 -0.271623 -0.285833 -0.299862 0.378832 0.003448 -0.256298 -0.228364 0.422070 0.009353 -0.231276 -0.199704 -0.186866 0.242441 -0.122601 -0.225857 0.284221 -0.247566 -0.197474 -0.119245 -0.138013 -0.186460 0.102217 0.095553 0.100154 0.092436 0.096985 0.098544 0.100084 0.092806 0.122949 0.100196 0.084922 0.104204 0.095019 0.088671 0.095812 0.126458 0.148120 0.145754 0.158416 0.148621 0.146265 0.156280 0.157670 0.159572 0.158539
qa: -0.2883 -0.4520 -0.3257 -0.0929 0.1475 -0.0257 -0.0825 -0.2716 -0.2858 -0.2999 0.3788 0.0034 -0.2563 -0.2284 0.4221 0.0094 -0.2313 -0.1997 -0.1869 0.2424 -0.1226 -0.2259 0.2842 -0.2476 -0.1975 -0.1192 -0.1380 -0.1865 0.1022 0.0956 0.1002 0.0924 0.0970 0.0985 0.1001 0.0928 0.1229 0.1002 0.0849 0.1042 0.0950 0.0887 0.0958 0.1265 0.1481 0.1458 0.1584 0.1486 0.1463 0.1563 0.1577 0.1596 0.1585
va: 2.1546 2.0507 2.0837 3.1082 3.7269 3.8260 3.8193 3.8902 3.9090 3.8948 4.1550 3.6915 3.9432 3.9344 3.7314 3.7364 4.0130 3.9548 3.9462 3.7768 3.9153 4.0025 3.6891 4.0128 3.9195 3.8820 3.8881 3.9083 1.0254 1.0275 0.9994 1.0152 1.0013 1.0031 0.9993 1.0016 1.0037 1.0018 1.0140 0.9963 0.9953 1.0064 0.9960 1.0269 1.0164 1.0024 0.9902 1.0051 1.0080 0.9974 0.9892 0.9901 0.9905
dispcorr: -0.024891941 hartree
energy: -1210.131538418393
dipole: 26.05781 -25.47146 0.58635 19.93356 -20.03403 -0.10047 -1.54275 -0.36080 -1.90355
magnitude: 1.99434 au
magnitude: 5.06922 debye
