program: Orca
programVersion: 5.0.2
elementType: O O O N C C C C C C C C C C C C C C C C C C C C C C C C H H H H H H H H H H H H H H H H H H H H H H H H H
charge: 0
multiplicity: 1
keywords: wb97x-d3
keywords: def2-TZVPP
keywords: def2/J RIJCOSX
keywords: DEFGRID2
keywords: scfconv7
keywords: smallprint printgap noloewdin
keywords: NOSOSCF
formula: C24H25NO3
InChI: InChI=1/C24H25NO3/c1-16(2)13-20-22(24(20,3)4)23(26)28-21(15-25)17-9-8-12-19(14-17)27-18-10-6-5-7-11-18/h5-14,20-22H,1-4H3
53 atoms
O  -0.607861 1.638931 1.053888
O  0.547817 1.9224 -0.837785
O  -1.257003 -3.458693 -1.991577
N  -3.68122 0.698721 1.802566
C  2.799109 2.878421 1.134117
C  2.105727 4.09139 0.598407
C  1.281604 2.962076 1.198417
C  3.477583 1.952688 0.154253
C  3.507855 2.941729 2.465946
C  2.127367 5.394053 1.29124
C  0.418703 2.142886 0.338876
C  2.284853 6.597009 0.729036
C  2.475718 6.844818 -0.735893
C  2.277233 7.837748 1.571322
C  -1.486404 0.754902 0.383862
C  -0.931055 -0.648774 0.270677
C  -2.707853 0.735629 1.19398
C  -1.323096 -1.434564 -0.803372
C  -0.099561 -1.165595 1.255546
C  -0.876966 -2.744749 -0.892769
C  0.349523 -2.473224 1.143509
C  -0.032642 -3.271555 0.076947
C  -1.597463 -4.778993 -1.849177
C  -2.443564 -5.208548 -0.833873
C  -1.113088 -5.67107 -2.793994
C  -2.796471 -6.548394 -0.769109
C  -1.482851 -7.007047 -2.722382
C  -2.320168 -7.45263 -1.709428
H  2.068062 4.131701 -0.484813
H  0.880458 3.14412 2.189019
H  3.061646 2.005167 -0.849182
H  4.533923 2.219363 0.080453
H  3.425614 0.914561 0.489266
H  2.969551 3.526546 3.210657
H  3.638777 1.937126 2.87275
H  4.500074 3.38293 2.349887
H  1.995417 5.359713 2.368606
H  3.386256 7.423875 -0.90961
H  2.544467 5.938667 -1.334303
H  1.651729 7.443738 -1.133229
H  1.4838 8.521141 1.256102
H  2.130037 7.61882 2.628959
H  3.215828 8.388777 1.468398
H  -1.757949 1.133552 -0.60728
H  -1.975299 -1.033791 -1.570898
H  0.202789 -0.566207 2.104097
H  1.008303 -2.879683 1.899577
H  0.331964 -4.288336 0.00263
H  -2.831359 -4.509943 -0.102575
H  -0.4561 -5.321136 -3.580415
H  -3.455936 -6.883596 0.02114
H  -1.105692 -7.702471 -3.461157
H  -2.603118 -8.495559 -1.654025
elementType: O N C H
totalener: -1210.10720313 hartree
nucrepener: 2381.09954302 hartree
electener: -3591.20674615 hartree
oneelecener: -6373.55587143 hartree
twoeener: 2782.34912528 hartree
cpcmener: -0.03109064 hartree
kineticenergy: 1204.70527338 hartree
xcener: -118.582533897863 hartree
chargesum: -0.0000000
charge: -0.288951 -0.446507 -0.329077 -0.088763 0.107236 0.037153 -0.088969 -0.272404 -0.272574 -0.270227 0.376259 -0.050304 -0.251857 -0.216206 0.396944 0.037488 -0.224344 -0.233217 -0.200910 0.229317 -0.151645 -0.149160 0.245856 -0.161903 -0.230036 -0.154767 -0.130898 -0.174419 0.097172 0.090660 0.094108 0.097030 0.096785 0.089235 0.097850 0.098409 0.116654 0.094411 0.089867 0.097635 0.092819 0.087630 0.092888 0.142192 0.134528 0.147153 0.159918 0.160007 0.157774 0.147203 0.159226 0.157578 0.158155
qa: -0.2890 -0.4465 -0.3291 -0.0888 0.1072 0.0372 -0.0890 -0.2724 -0.2726 -0.2702 0.3763 -0.0503 -0.2519 -0.2162 0.3969 0.0375 -0.2243 -0.2332 -0.2009 0.2293 -0.1516 -0.1492 0.2459 -0.1619 -0.2300 -0.1548 -0.1309 -0.1744 0.0972 0.0907 0.0941 0.0970 0.0968 0.0892 0.0978 0.0984 0.1167 0.0944 0.0899 0.0976 0.0928 0.0876 0.0929 0.1422 0.1345 0.1472 0.1599 0.1600 0.1578 0.1472 0.1592 0.1576 0.1582
va: 2.1087 2.0651 2.0661 3.1145 3.6883 3.8034 3.8305 3.9029 3.9123 3.8830 4.1834 3.7679 3.9407 3.9206 3.7212 3.6437 4.0695 4.0932 3.9503 3.7843 3.9259 3.9000 3.7187 3.8929 3.9969 3.8982 3.8918 3.8946 1.0274 1.0366 1.0183 1.0006 1.0003 1.0063 1.0017 1.0015 1.0117 0.9977 1.0107 0.9963 0.9963 1.0091 0.9966 1.0216 1.0174 1.0132 0.9914 0.9940 0.9964 1.0067 0.9905 0.9893 0.9902
dispcorr: -0.024174179 hartree
energy: -1210.131377305701
dipole: 26.81925 -24.94256 1.87669 29.23524 -29.37972 -0.14448 6.00574 -5.73007 0.27568
magnitude: 1.90232 au
magnitude: 4.83532 debye
