program: Orca
programVersion: 5.0.2
elementType: O O O N C C C C C C C C C C C C C C C C C C C C C C C C H H H H H H H H H H H H H H H H H H H H H H H H H
charge: 0
multiplicity: 1
keywords: wb97x-d3
keywords: def2-TZVPP
keywords: def2/J RIJCOSX
keywords: DEFGRID2
keywords: scfconv7
keywords: smallprint printgap noloewdin
keywords: NOSOSCF
formula: C24H25NO3
InChI: InChI=1/C24H25NO3/c1-16(2)13-20-22(24(20,3)4)23(26)28-21(15-25)17-9-8-12-19(14-17)27-18-10-6-5-7-11-18/h5-14,20-22H,1-4H3
53 atoms
O  -0.838657 1.981713 0.467775
O  0.854244 1.343806 -0.841907
O  -1.680504 -3.585465 -1.414179
N  -4.128529 1.8557 0.332589
C  2.544955 2.630957 1.50172
C  2.507865 3.551487 0.331871
C  1.204984 2.990811 0.867813
C  3.118301 1.245115 1.337093
C  2.766047 3.206522 2.879789
C  2.7953 5.003855 0.465112
C  0.446628 2.024186 0.065174
C  2.131101 5.982043 -0.15512
C  0.973323 5.740664 -1.074105
C  2.495604 7.421233 0.04586
C  -1.693096 1.092044 -0.228579
C  -1.51233 -0.351614 0.18493
C  -3.051718 1.533043 0.09782
C  -1.615317 -1.338408 -0.782033
C  -1.28152 -0.686229 1.513891
C  -1.508081 -2.674299 -0.417568
C  -1.164433 -2.023288 1.860075
C  -1.283244 -3.025356 0.907703
C  -1.0767 -4.81407 -1.343998
C  -1.86181 -5.928676 -1.595671
C  0.284529 -4.941892 -1.097703
C  -1.2751 -7.186864 -1.606754
C  0.854942 -6.206206 -1.099091
C  0.0814 -7.331631 -1.353236
H  2.822062 3.097404 -0.605644
H  0.591224 3.667834 1.451146
H  3.068756 0.877789 0.314237
H  4.170682 1.250348 1.627998
H  2.605208 0.526951 1.980155
H  3.833425 3.312676 3.08504
H  2.304781 4.186111 3.006266
H  2.349506 2.545227 3.64195
H  3.627755 5.273463 1.109569
H  0.04188 6.097983 -0.62609
H  1.099963 6.298281 -2.005192
H  0.837544 4.692296 -1.33314
H  2.790949 7.888664 -0.897081
H  1.640124 7.992179 0.416982
H  3.314543 7.544585 0.754614
H  -1.568877 1.18995 -1.312662
H  -1.784651 -1.076463 -1.819953
H  -1.198244 0.07777 2.276038
H  -0.989222 -2.296122 2.892418
H  -1.206161 -4.062748 1.206748
H  -2.920837 -5.810991 -1.788736
H  0.897311 -4.068221 -0.912551
H  -1.88725 -8.056349 -1.808393
H  1.915255 -6.308561 -0.907195
H  0.534972 -8.313967 -1.357007
elementType: O N C H
totalener: -1210.10597766 hartree
nucrepener: 2418.49677141 hartree
electener: -3628.60274908 hartree
oneelecener: -6448.37059173 hartree
twoeener: 2819.76784265 hartree
cpcmener: -0.03003459 hartree
kineticenergy: 1204.71209823 hartree
xcener: -118.583040372647 hartree
chargesum: -0.0000000
charge: -0.286752 -0.448453 -0.324589 -0.088322 0.140030 -0.004451 -0.104390 -0.275017 -0.284894 -0.298485 0.371135 -0.011703 -0.240166 -0.227192 0.400958 0.033611 -0.227155 -0.237428 -0.219226 0.266251 -0.144935 -0.173664 0.262206 -0.232217 -0.183206 -0.129131 -0.146065 -0.174366 0.107123 0.096569 0.093861 0.096221 0.098255 0.099264 0.094148 0.098357 0.121163 0.101957 0.100714 0.081915 0.096717 0.093900 0.088857 0.141306 0.132907 0.146982 0.159672 0.156617 0.146195 0.159485 0.158167 0.159205 0.158059
qa: -0.2868 -0.4485 -0.3246 -0.0883 0.1400 -0.0045 -0.1044 -0.2750 -0.2849 -0.2985 0.3711 -0.0117 -0.2402 -0.2272 0.4010 0.0336 -0.2272 -0.2374 -0.2192 0.2663 -0.1449 -0.1737 0.2622 -0.2322 -0.1832 -0.1291 -0.1461 -0.1744 0.1071 0.0966 0.0939 0.0962 0.0983 0.0993 0.0941 0.0984 0.1212 0.1020 0.1007 0.0819 0.0967 0.0939 0.0889 0.1413 0.1329 0.1470 0.1597 0.1566 0.1462 0.1595 0.1582 0.1592 0.1581
va: 2.1085 2.0613 2.0782 3.1146 3.7132 3.8120 3.8134 3.8942 3.9078 3.8945 4.1610 3.7087 3.9354 3.9322 3.7239 3.6313 4.0759 4.0902 3.9591 3.7706 3.9253 3.9020 3.7011 4.0067 3.9206 3.8876 3.8900 3.8983 1.0235 1.0292 1.0166 1.0017 0.9999 1.0002 1.0022 1.0030 1.0039 0.9981 1.0003 1.0125 0.9965 0.9965 1.0064 1.0201 1.0190 1.0132 0.9911 0.9964 1.0071 0.9954 0.9893 0.9903 0.9904
dispcorr: -0.025282475 hartree
energy: -1210.131260136813
dipole: 25.10112 -23.21026 1.89086 24.92455 -25.25715 -0.33260 7.83507 -7.11089 0.72418
magnitude: 2.05193 au
magnitude: 5.21558 debye
