program: Orca
programVersion: 5.0.2
elementType: O O O N C C C C C C C C C C C C C C C C C C C C C C C C H H H H H H H H H H H H H H H H H H H H H H H H H
charge: 0
multiplicity: 1
keywords: wb97x-d3
keywords: def2-TZVPP
keywords: def2/J RIJCOSX
keywords: DEFGRID2
keywords: scfconv7
keywords: smallprint printgap noloewdin
keywords: NOSOSCF
formula: C24H25NO3
InChI: InChI=1/C24H25NO3/c1-16(2)13-20-22(24(20,3)4)23(26)28-21(15-25)17-9-8-12-19(14-17)27-18-10-6-5-7-11-18/h5-14,20-22H,1-4H3
53 atoms
O  -1.311312 2.347623 0.208815
O  -1.391951 2.579629 -2.006433
O  0.308116 -2.355979 0.043537
N  -3.440135 1.53083 2.59415
C  1.132088 4.168306 0.213815
C  1.573396 2.742281 0.136798
C  0.564881 3.281975 -0.880586
C  0.293495 4.60425 1.392426
C  2.047276 5.267383 -0.275173
C  2.902412 2.310595 -0.331027
C  -0.791575 2.727333 -0.971199
C  3.526334 1.172493 -0.005717
C  2.97417 0.111905 0.897285
C  4.881692 0.859137 -0.565656
C  -2.503344 1.581887 0.155584
C  -2.243529 0.174292 -0.333629
C  -3.013509 1.565754 1.528037
C  -1.115699 -0.50467 0.10898
C  -3.126915 -0.427651 -1.216309
C  -0.860061 -1.782906 -0.361826
C  -2.869041 -1.716507 -1.662225
C  -1.73475 -2.39851 -1.251336
C  0.385533 -3.704101 0.269085
C  1.530186 -4.353432 -0.170056
C  -0.599309 -4.391712 0.967296
C  1.691415 -5.705593 0.096588
C  -0.429256 -5.745847 1.216573
C  0.712513 -6.408185 0.785292
H  1.124801 2.111469 0.895305
H  0.964016 3.483957 -1.868256
H  -0.226183 3.785831 1.883955
H  0.940111 5.067502 2.140508
H  -0.44761 5.349573 1.096775
H  2.583862 5.007139 -1.186794
H  1.47315 6.171849 -0.485189
H  2.78702 5.515667 0.48838
H  3.409685 2.980523 -1.018795
H  2.038222 0.377843 1.382108
H  2.804033 -0.812917 0.3410
H  3.692194 -0.134165 1.682482
H  5.618912 0.746957 0.233727
H  4.871929 -0.088669 -1.110828
H  5.23898 1.633581 -1.244218
H  -3.264526 2.062842 -0.467339
H  -0.421944 -0.04962 0.806364
H  -4.00357 0.105972 -1.560978
H  -3.548095 -2.190649 -2.35843
H  -1.534855 -3.392475 -1.63095
H  2.290097 -3.80157 -0.709426
H  -1.486039 -3.881503 1.322574
H  2.58628 -6.210467 -0.243905
H  -1.194847 -6.282979 1.761419
H  0.839095 -7.463557 0.987566
elementType: O N C H
totalener: -1210.10366352 hartree
nucrepener: 2521.19501407 hartree
electener: -3731.29867759 hartree
oneelecener: -6653.60429905 hartree
twoeener: 2922.30562146 hartree
cpcmener: -0.03205557 hartree
kineticenergy: 1204.71244096 hartree
xcener: -118.585199102693 hartree
chargesum: -0.0000000
charge: -0.281340 -0.439927 -0.327115 -0.087817 0.108733 0.022362 -0.066681 -0.263305 -0.287704 -0.272975 0.366792 -0.026630 -0.276365 -0.221521 0.373618 0.023671 -0.231261 -0.216021 -0.202717 0.225084 -0.123344 -0.176403 0.281462 -0.251025 -0.189885 -0.121376 -0.141903 -0.182715 0.106564 0.090172 0.089177 0.094326 0.099349 0.091094 0.098692 0.100302 0.115677 0.091658 0.093889 0.100940 0.094456 0.092340 0.087853 0.144187 0.149858 0.144922 0.160703 0.157997 0.147976 0.159241 0.158460 0.158653 0.157825
qa: -0.2813 -0.4399 -0.3271 -0.0878 0.1087 0.0224 -0.0667 -0.2633 -0.2877 -0.2730 0.3668 -0.0266 -0.2764 -0.2215 0.3736 0.0237 -0.2313 -0.2160 -0.2027 0.2251 -0.1233 -0.1764 0.2815 -0.2510 -0.1899 -0.1214 -0.1419 -0.1827 0.1066 0.0902 0.0892 0.0943 0.0993 0.0911 0.0987 0.1003 0.1157 0.0917 0.0939 0.1009 0.0945 0.0923 0.0879 0.1442 0.1499 0.1449 0.1607 0.1580 0.1480 0.1592 0.1585 0.1587 0.1578
va: 2.1056 2.0702 2.0649 3.1083 3.7191 3.7735 3.8065 3.9043 3.9232 3.8880 4.2051 3.7404 3.9448 3.9252 3.7598 3.6329 4.0705 4.0337 3.9874 3.8278 3.9033 3.9361 3.6820 4.0017 3.9286 3.8848 3.8973 3.9043 1.0121 1.0298 1.0111 1.0000 1.0009 1.0070 1.0005 1.0002 1.0132 1.0093 1.0022 0.9996 0.9960 0.9963 1.0090 1.0152 1.0141 1.0020 0.9898 0.9941 1.0060 0.9958 0.9894 0.9903 0.9904
dispcorr: -0.027245540 hartree
energy: -1210.130909064031
dipole: 25.40022 -24.29253 1.10770 9.90137 -10.64114 -0.73977 0.65870 -1.36026 -0.70156
magnitude: 1.50547 au
magnitude: 3.82659 debye
