program: Orca
programVersion: 5.0.2
elementType: O O O N C C C C C C C C C C C C C C C C C C C C C C C C H H H H H H H H H H H H H H H H H H H H H H H H H
charge: 0
multiplicity: 1
keywords: wb97x-d3
keywords: def2-TZVPP
keywords: def2/J RIJCOSX
keywords: DEFGRID2
keywords: scfconv7
keywords: smallprint printgap noloewdin
keywords: NOSOSCF
formula: C24H25NO3
InChI: InChI=1/C24H25NO3/c1-16(2)13-20-22(24(20,3)4)23(26)28-21(15-25)17-9-8-12-19(14-17)27-18-10-6-5-7-11-18/h5-14,20-22H,1-4H3
53 atoms
O  -0.189213 1.321537 1.241683
O  -0.859039 2.679651 -0.402605
O  -0.058246 -3.506723 -0.610276
N  -1.750733 -0.30562 3.650088
C  2.228076 3.051562 -0.838809
C  1.699794 4.207639 -0.065668
C  1.390577 2.798672 0.410317
C  1.669215 2.769092 -2.212021
C  3.685394 2.680824 -0.703562
C  2.577927 5.088568 0.747515
C  0.013344 2.29925 0.337212
C  2.249436 5.62614 1.925043
C  0.938933 5.383673 2.60823
C  3.197382 6.519128 2.664868
C  -1.481021 0.722129 1.262421
C  -1.612244 -0.344306 0.202377
C  -1.617942 0.15248 2.605242
C  -0.817676 -1.482253 0.275769
C  -2.494917 -0.171546 -0.853697
C  -0.905653 -2.444861 -0.716839
C  -2.571086 -1.14317 -1.842167
C  -1.777646 -2.277615 -1.787848
C  -0.438192 -4.755396 -1.021272
C  -1.7042 -5.268879 -0.766528
C  0.527219 -5.526978 -1.652146
C  -1.998649 -6.565821 -1.16209
C  0.2222 -6.826689 -2.029103
C  -1.041814 -7.349522 -1.793389
H  0.848932 4.703471 -0.528131
H  1.950688 2.451358 1.270907
H  2.302579 3.244628 -2.96383
H  1.659613 1.698151 -2.424031
H  0.660591 3.150659 -2.354929
H  4.068037 2.839224 0.304891
H  3.835373 1.628378 -0.951569
H  4.297853 3.270383 -1.389195
H  3.550986 5.324514 0.325112
H  0.224831 4.837116 1.994566
H  1.084406 4.819908 3.534149
H  0.473889 6.329933 2.896054
H  4.145134 6.640986 2.140184
H  2.765677 7.512056 2.816092
H  3.411803 6.122099 3.660921
H  -2.269328 1.472457 1.14538
H  -0.128008 -1.630507 1.099236
H  -3.115897 0.7130 -0.908853
H  -3.249777 -1.011905 -2.674519
H  -1.83938 -3.017623 -2.575702
H  -2.454943 -4.6740 -0.261276
H  1.510851 -5.113912 -1.838134
H  -2.985177 -6.965884 -0.96618
H  0.977653 -7.429682 -2.516182
H  -1.27845 -8.361385 -2.094743
elementType: O N C H
totalener: -1210.10603970 hartree
nucrepener: 2421.38641914 hartree
electener: -3631.49245884 hartree
oneelecener: -6454.29501923 hartree
twoeener: 2822.80256039 hartree
cpcmener: -0.02872348 hartree
kineticenergy: 1204.70513817 hartree
xcener: -118.581369492594 hartree
chargesum: -0.0000000
charge: -0.285894 -0.456765 -0.325742 -0.090024 0.146846 -0.013606 -0.107827 -0.279456 -0.285271 -0.295684 0.390087 -0.011183 -0.241046 -0.226919 0.424528 0.002456 -0.232680 -0.230122 -0.181887 0.242158 -0.130441 -0.185200 0.282692 -0.192266 -0.245731 -0.146089 -0.123456 -0.182743 0.105817 0.095962 0.095879 0.100190 0.093777 0.093435 0.098495 0.098783 0.122068 0.082068 0.100960 0.100749 0.089124 0.096298 0.093930 0.136519 0.134987 0.144203 0.160944 0.157501 0.157741 0.146647 0.159643 0.157842 0.157701
qa: -0.2859 -0.4568 -0.3257 -0.0900 0.1468 -0.0136 -0.1078 -0.2795 -0.2853 -0.2957 0.3901 -0.0112 -0.2410 -0.2269 0.4245 0.0025 -0.2327 -0.2301 -0.1819 0.2422 -0.1304 -0.1852 0.2827 -0.1923 -0.2457 -0.1461 -0.1235 -0.1827 0.1058 0.0960 0.0959 0.1002 0.0938 0.0934 0.0985 0.0988 0.1221 0.0821 0.1010 0.1007 0.0891 0.0963 0.0939 0.1365 0.1350 0.1442 0.1609 0.1575 0.1577 0.1466 0.1596 0.1578 0.1577
va: 2.1211 2.0544 2.0783 3.1127 3.7055 3.8181 3.8272 3.8929 3.9098 3.8915 4.1474 3.7083 3.9368 3.9316 3.7218 3.6284 4.0763 4.0903 3.9578 3.8004 3.9082 3.9257 3.6912 3.9095 4.0062 3.8912 3.8881 3.9035 1.0232 1.0296 1.0013 0.9988 1.0175 1.0020 1.0030 1.0001 1.0036 1.0128 0.9982 0.9999 1.0063 0.9966 0.9965 1.0162 1.0257 1.0103 0.9906 0.9950 0.9965 1.0079 0.9902 0.9893 0.9906
dispcorr: -0.025064558 hartree
energy: -1210.131104261910
dipole: 19.05329 -18.56763 0.48566 26.91360 -26.63047 0.28313 -2.94583 1.42744 -1.51839
magnitude: 1.61912 au
magnitude: 4.11547 debye
