program: Orca
programVersion: 5.0.2
elementType: O O O N C C C C C C C C C C C C C C C C C C C C C C C C H H H H H H H H H H H H H H H H H H H H H H H H H
charge: 0
multiplicity: 1
keywords: wb97x-d3
keywords: def2-TZVPP
keywords: def2/J RIJCOSX
keywords: DEFGRID2
keywords: scfconv7
keywords: smallprint printgap noloewdin
keywords: NOSOSCF
formula: C24H25NO3
InChI: InChI=1/C24H25NO3/c1-16(2)13-20-22(24(20,3)4)23(26)28-21(15-25)17-9-8-12-19(14-17)27-18-10-6-5-7-11-18/h5-14,20-22H,1-4H3
53 atoms
O  -1.23561 1.978548 0.664398
O  0.292205 1.655497 -0.935413
O  -1.310426 -3.189453 -1.850109
N  -4.526479 2.025878 0.730045
C  2.273033 2.347723 1.415789
C  2.09739 3.559298 0.552489
C  0.872472 2.835773 1.070854
C  2.827713 1.090751 0.792986
C  2.687064 2.526454 2.8559
C  2.365724 4.929908 1.045942
C  0.000124 2.102611 0.144374
C  3.328114 5.747054 0.608872
C  4.320081 5.388888 -0.45474
C  3.487934 7.122634 1.18312
C  -2.177987 1.223399 -0.086899
C  -2.005143 -0.259451 0.13744
C  -3.489143 1.678509 0.38069
C  -1.722746 -1.082055 -0.939541
C  -2.099179 -0.783336 1.423774
C  -1.549832 -2.447829 -0.735898
C  -1.922573 -2.142607 1.611272
C  -1.650879 -2.985015 0.540502
C  -0.818062 -4.46614 -1.726328
C  -1.617515 -5.522826 -2.130585
C  0.471142 -4.68045 -1.25783
C  -1.112909 -6.815523 -2.07365
C  0.960375 -5.976916 -1.197931
C  0.172279 -7.04653 -1.604373
H  2.306924 3.386648 -0.498745
H  0.346946 3.315232 1.889786
H  2.633592 1.014497 -0.274492
H  3.91123 1.070223 0.926802
H  2.422013 0.19867 1.275043
H  2.223764 3.39312 3.326379
H  2.415999 1.647678 3.444085
H  3.769808 2.651282 2.927241
H  1.713472 5.290664 1.836443
H  4.267428 6.092829 -1.289597
H  5.33853 5.455289 -0.062749
H  4.189908 4.385107 -0.855201
H  4.4785 7.251118 1.627914
H  3.399028 7.886164 0.4055
H  2.744825 7.338177 1.950827
H  -2.115549 1.458776 -1.153964
H  -1.639792 -0.673146 -1.939519
H  -2.314742 -0.142924 2.27017
H  -2.003139 -2.563495 2.604804
H  -1.529254 -4.046071 0.714663
H  -2.620491 -5.335518 -2.493342
H  1.087476 -3.844925 -0.948938
H  -1.732253 -7.643481 -2.39344
H  1.965389 -6.150087 -0.835252
H  0.560915 -8.055502 -1.558012
elementType: O N C H
totalener: -1210.10732229 hartree
nucrepener: 2404.52202840 hartree
electener: -3614.62935069 hartree
oneelecener: -6420.51992168 hartree
twoeener: 2805.89057099 hartree
cpcmener: -0.02996980 hartree
kineticenergy: 1204.70919600 hartree
xcener: -118.581440808538 hartree
chargesum: -0.0000000
charge: -0.281485 -0.450731 -0.322567 -0.089418 0.135065 0.023327 -0.131057 -0.286200 -0.258501 -0.273396 0.397448 -0.035570 -0.250792 -0.224059 0.402736 0.015573 -0.226449 -0.216274 -0.222110 0.276341 -0.156898 -0.178983 0.224047 -0.196647 -0.170042 -0.144687 -0.153000 -0.157369 0.097825 0.090305 0.094495 0.096556 0.099300 0.088321 0.097878 0.096643 0.119141 0.096277 0.095364 0.089162 0.093314 0.093998 0.088737 0.135824 0.133158 0.148139 0.160261 0.152427 0.147713 0.159454 0.158853 0.159391 0.159162
qa: -0.2815 -0.4507 -0.3226 -0.0894 0.1351 0.0233 -0.1311 -0.2862 -0.2585 -0.2734 0.3974 -0.0356 -0.2508 -0.2241 0.4027 0.0156 -0.2264 -0.2163 -0.2221 0.2763 -0.1569 -0.1790 0.2240 -0.1966 -0.1700 -0.1447 -0.1530 -0.1574 0.0978 0.0903 0.0945 0.0966 0.0993 0.0883 0.0979 0.0966 0.1191 0.0963 0.0954 0.0892 0.0933 0.0940 0.0887 0.1358 0.1332 0.1481 0.1603 0.1524 0.1477 0.1595 0.1589 0.1594 0.1592
va: 2.1279 2.0643 2.0796 3.1121 3.6820 3.7733 3.9103 3.9036 3.9043 3.8760 4.1745 3.7287 3.9445 3.9245 3.7380 3.6269 4.0745 4.0590 3.9817 3.7762 3.9451 3.8980 3.7319 3.9902 3.9391 3.8906 3.8927 3.8845 1.0258 1.0394 1.0178 1.0009 0.9994 1.0044 1.0029 1.0031 1.0085 0.9975 0.9976 1.0085 0.9965 0.9958 1.0084 1.0188 1.0236 1.0096 0.9915 1.0006 1.0045 0.9955 0.9896 0.9902 0.9898
dispcorr: -0.024465939 hartree
energy: -1210.131788224855
dipole: 33.22983 -31.06411 2.16572 21.00430 -21.93798 -0.93368 9.82197 -9.13798 0.68398
magnitude: 2.45560 au
magnitude: 6.24163 debye
