program: Orca
programVersion: 5.0.2
elementType: O O O N C C C C C C C C C C C C C C C C C C C C C C C C H H H H H H H H H H H H H H H H H H H H H H H H H
charge: 0
multiplicity: 1
keywords: wb97x-d3
keywords: def2-TZVPP
keywords: def2/J RIJCOSX
keywords: DEFGRID2
keywords: scfconv7
keywords: smallprint printgap noloewdin
keywords: NOSOSCF
formula: C24H25NO3
InChI: InChI=1/C24H25NO3/c1-16(2)13-20-22(24(20,3)4)23(26)28-21(15-25)17-9-8-12-19(14-17)27-18-10-6-5-7-11-18/h5-14,20-22H,1-4H3
53 atoms
O  -0.790572 1.446209 1.175416
O  -0.642674 2.775021 -0.616574
O  -1.43434 -3.606723 0.187918
N  -3.37406 0.71634 3.102134
C  2.432313 2.322033 -0.223097
C  2.06418 3.640497 0.382129
C  1.278654 2.398817 0.766335
C  2.174526 2.108404 -1.694823
C  3.662426 1.59517 0.264674
C  2.893825 4.30199 1.410148
C  -0.119208 2.258298 0.337789
C  3.332334 5.56473 1.383578
C  3.056467 6.543406 0.283392
C  4.172703 6.106136 2.50108
C  -2.13864 1.134991 0.839572
C  -2.205312 -0.083956 -0.047015
C  -2.81784 0.90822 2.116323
C  -1.763252 -1.308341 0.43914
C  -2.661518 0.030598 -1.352163
C  -1.803674 -2.425989 -0.379609
C  -2.68656 -1.095058 -2.164093
C  -2.263615 -2.3260 -1.6889
C  -0.856327 -4.591134 -0.570256
C  0.267593 -4.338938 -1.346467
C  -1.387741 -5.86816 -0.47778
C  0.862052 -5.387674 -2.032807
C  -0.777035 -6.909794 -1.162319
C  0.345362 -6.674024 -1.943684
H  1.536222 4.30322 -0.295317
H  1.491859 1.983662 1.745119
H  1.905919 1.070391 -1.903153
H  1.389608 2.746806 -2.093839
H  3.086053 2.3283 -2.254298
H  3.607502 0.5368 0.002998
H  4.558705 2.00461 -0.206226
H  3.797391 1.658708 1.343718
H  3.172176 3.690807 2.263851
H  2.4639 6.136378 -0.533672
H  2.532012 7.42162 0.669238
H  3.993522 6.910309 -0.143932
H  5.145274 6.444277 2.133255
H  3.699041 6.977215 2.962288
H  4.348015 5.367095 3.282907
H  -2.63478 1.98206 0.357076
H  -1.398414 -1.408909 1.455517
H  -2.997989 0.985994 -1.73328
H  -3.045932 -1.016418 -3.181571
H  -2.307587 -3.195771 -2.332013
H  0.683874 -3.340617 -1.406741
H  -2.263897 -6.046044 0.133152
H  1.740904 -5.196371 -2.634875
H  -1.187095 -7.908542 -1.085778
H  0.817952 -7.488034 -2.477407
elementType: O N C H
totalener: -1210.10768141 hartree
nucrepener: 2409.24087460 hartree
electener: -3619.34855601 hartree
oneelecener: -6429.80123701 hartree
twoeener: 2810.45268100 hartree
cpcmener: -0.02995855 hartree
kineticenergy: 1204.71356169 hartree
xcener: -118.582841140065 hartree
chargesum: -0.0000000
charge: -0.285312 -0.454386 -0.324589 -0.089273 0.113400 0.042358 -0.117296 -0.281043 -0.265463 -0.275486 0.399966 -0.044299 -0.250608 -0.218309 0.419825 0.002349 -0.230895 -0.224178 -0.176009 0.224179 -0.143674 -0.160872 0.245361 -0.170440 -0.226256 -0.151803 -0.131748 -0.169794 0.095505 0.090644 0.100205 0.094277 0.096454 0.098063 0.097466 0.087898 0.117911 0.089321 0.096496 0.094726 0.092926 0.092991 0.088022 0.131161 0.134609 0.145332 0.160319 0.156818 0.160920 0.146799 0.159215 0.158040 0.158177
qa: -0.2853 -0.4544 -0.3246 -0.0893 0.1134 0.0424 -0.1173 -0.2810 -0.2655 -0.2755 0.4000 -0.0443 -0.2506 -0.2183 0.4198 0.0023 -0.2309 -0.2242 -0.1760 0.2242 -0.1437 -0.1609 0.2454 -0.1704 -0.2263 -0.1518 -0.1317 -0.1698 0.0955 0.0906 0.1002 0.0943 0.0965 0.0981 0.0975 0.0879 0.1179 0.0893 0.0965 0.0947 0.0929 0.0930 0.0880 0.1312 0.1346 0.1453 0.1603 0.1568 0.1609 0.1468 0.1592 0.1580 0.1582
va: 2.1282 2.0565 2.0733 3.1113 3.6824 3.7779 3.8813 3.9059 3.9105 3.8748 4.1715 3.7590 3.9430 3.9224 3.7233 3.6634 4.0827 4.0797 3.9452 3.8202 3.9209 3.8995 3.7156 3.9167 4.0043 3.8959 3.8895 3.8939 1.0290 1.0373 0.9989 1.0177 1.0005 1.0021 1.0021 1.0060 1.0105 1.0100 0.9969 0.9975 0.9964 0.9962 1.0090 1.0213 1.0257 1.0078 0.9911 0.9966 0.9952 1.0068 0.9905 0.9893 0.9901
dispcorr: -0.024124274 hartree
energy: -1210.131805685408
dipole: 31.83370 -30.07472 1.75898 23.92640 -24.14570 -0.21930 -5.35429 3.53626 -1.81803
magnitude: 2.53916 au
magnitude: 6.45403 debye
