program: Orca
programVersion: 5.0.2
elementType: O O O N C C C C C C C C C C C C C C C C C C C C C C C C H H H H H H H H H H H H H H H H H H H H H H H H H
charge: 0
multiplicity: 1
keywords: wb97x-d3
keywords: def2-TZVPP
keywords: def2/J RIJCOSX
keywords: DEFGRID2
keywords: scfconv7
keywords: smallprint printgap noloewdin
keywords: NOSOSCF
formula: C24H25NO3
InChI: InChI=1/C24H25NO3/c1-16(2)13-20-22(24(20,3)4)23(26)28-21(15-25)17-9-8-12-19(14-17)27-18-10-6-5-7-11-18/h5-14,20-22H,1-4H3
53 atoms
O  -0.880531 1.864159 0.701493
O  0.561005 1.674011 -0.997596
O  -0.438756 -3.175089 -1.777446
N  -4.175165 1.861826 0.863148
C  2.645735 2.250462 1.286937
C  2.441007 3.480457 0.473526
C  1.22972 2.758478 1.030562
C  3.146828 0.996454 0.614189
C  3.112276 2.381294 2.716718
C  2.803783 4.831077 0.977515
C  0.319934 2.052905 0.120846
C  2.120026 5.953898 0.743217
C  0.851333 6.003099 -0.050019
C  2.589938 7.274102 1.272976
C  -1.839467 1.106835 -0.030586
C  -1.623931 -0.373416 0.170046
C  -3.142619 1.536503 0.480292
C  -1.179209 -1.144027 -0.892162
C  -1.820667 -0.946478 1.42254
C  -0.921324 -2.496791 -0.700801
C  -1.564754 -2.295567 1.596845
C  -1.110012 -3.079513 0.545188
C  -0.60073 -4.536285 -1.852008
C  -1.870389 -5.09767 -1.882465
C  0.532876 -5.326955 -1.953743
C  -1.997852 -6.471998 -2.015165
C  0.391065 -6.701164 -2.09467
C  -0.870733 -7.27752 -2.120849
H  2.576279 3.336058 -0.59624
H  0.746628 3.212985 1.887898
H  2.747224 0.102032 1.096257
H  2.902145 0.946619 -0.444407
H  4.234845 0.953017 0.695354
H  2.800589 1.512619 3.299731
H  4.202071 2.433912 2.763427
H  2.714818 3.268366 3.209826
H  3.720636 4.899184 1.557031
H  0.024356 6.367398 0.56586
H  0.946259 6.707126 -0.880869
H  0.561438 5.039389 -0.464913
H  3.506901 7.181731 1.855109
H  2.776558 7.980226 0.459616
H  1.830299 7.733507 1.911177
H  -1.813276 1.356271 -1.0956
H  -1.025845 -0.702361 -1.869039
H  -2.171893 -0.351589 2.256612
H  -1.714437 -2.750122 2.567023
H  -0.903584 -4.129171 0.709722
H  -2.749872 -4.469455 -1.810689
H  1.515087 -4.871976 -1.92829
H  -2.985427 -6.913722 -2.042368
H  1.274141 -7.321478 -2.177304
H  -0.977221 -8.349027 -2.227281
elementType: O N C H
totalener: -1210.10612621 hartree
nucrepener: 2422.90752952 hartree
electener: -3633.01365572 hartree
oneelecener: -6457.35836187 hartree
twoeener: 2824.34470614 hartree
cpcmener: -0.02846262 hartree
kineticenergy: 1204.71785065 hartree
xcener: -118.583124840844 hartree
chargesum: -0.0000000
charge: -0.280199 -0.455809 -0.324809 -0.089593 0.142577 -0.012725 -0.118718 -0.277074 -0.286311 -0.291880 0.400490 -0.014714 -0.238290 -0.226521 0.402039 0.006748 -0.224111 -0.208418 -0.211106 0.256399 -0.154672 -0.169020 0.231693 -0.166523 -0.210627 -0.151362 -0.138383 -0.163301 0.106364 0.096324 0.099344 0.093944 0.096266 0.098722 0.099094 0.094237 0.121434 0.098642 0.101061 0.081633 0.088860 0.095671 0.094012 0.133438 0.131777 0.145373 0.160611 0.154639 0.158901 0.147848 0.159192 0.158170 0.158665
qa: -0.2802 -0.4558 -0.3248 -0.0896 0.1426 -0.0127 -0.1187 -0.2771 -0.2863 -0.2919 0.4005 -0.0147 -0.2383 -0.2265 0.4020 0.0067 -0.2241 -0.2084 -0.2111 0.2564 -0.1547 -0.1690 0.2317 -0.1665 -0.2106 -0.1514 -0.1384 -0.1633 0.1064 0.0963 0.0993 0.0939 0.0963 0.0987 0.0991 0.0942 0.1214 0.0986 0.1011 0.0816 0.0889 0.0957 0.0940 0.1334 0.1318 0.1454 0.1606 0.1546 0.1589 0.1478 0.1592 0.1582 0.1587
va: 2.1226 2.0555 2.0746 3.1120 3.7098 3.8154 3.8347 3.8940 3.9084 3.8880 4.1465 3.7129 3.9356 3.9305 3.7404 3.6440 4.0685 4.0396 3.9877 3.7836 3.9385 3.9021 3.7270 3.9279 3.9957 3.8925 3.8887 3.8883 1.0232 1.0299 0.9989 1.0173 1.0015 1.0029 1.0001 1.0021 1.0036 0.9989 0.9993 1.0132 1.0065 0.9963 0.9970 1.0192 1.0283 1.0089 0.9916 0.9985 0.9951 1.0053 0.9903 0.9896 0.9900
dispcorr: -0.025190164 hartree
energy: -1210.131316372844
dipole: 23.29543 -21.83701 1.45842 22.14735 -23.00611 -0.85876 9.53620 -8.95405 0.58214
magnitude: 1.78979 au
magnitude: 4.54929 debye
