program: Orca
programVersion: 5.0.2
elementType: O O O N C C C C C C C C C C C C C C C C C C C C C C C C H H H H H H H H H H H H H H H H H H H H H H H H H
charge: 0
multiplicity: 1
keywords: wb97x-d3
keywords: def2-TZVPP
keywords: def2/J RIJCOSX
keywords: DEFGRID2
keywords: scfconv7
keywords: smallprint printgap noloewdin
keywords: NOSOSCF
formula: C24H25NO3
InChI: InChI=1/C24H25NO3/c1-16(2)13-20-22(24(20,3)4)23(26)28-21(15-25)17-9-8-12-19(14-17)27-18-10-6-5-7-11-18/h5-14,20-22H,1-4H3
53 atoms
O  -1.341859 1.493023 0.592909
O  -0.181132 1.867322 -1.291006
O  -1.597948 -3.516347 0.012183
N  -4.259114 3.022769 0.823035
C  2.10508 0.937821 0.736092
C  2.260981 2.373554 0.336567
C  0.922984 1.896406 0.83486
C  2.132252 -0.126283 -0.332396
C  2.690075 0.482476 2.049103
C  3.029578 3.345976 1.155596
C  -0.21105 1.77181 -0.092075
C  4.318706 3.642403 0.972578
C  5.173639 2.995729 -0.073377
C  5.010698 4.662813 1.823283
C  -2.544139 1.29702 -0.130422
C  -3.015486 -0.139544 -0.018703
C  -3.51151 2.254489 0.412032
C  -2.0658 -1.154126 -0.032499
C  -4.368209 -0.450428 0.023086
C  -2.480627 -2.478466 -0.016445
C  -4.765356 -1.779668 0.053035
C  -3.830533 -2.799901 0.027773
C  -0.401908 -3.439117 -0.651136
C  0.713508 -3.949019 -0.002765
C  -0.304954 -2.938571 -1.944111
C  1.937451 -3.960461 -0.65687
C  0.927974 -2.943568 -2.580006
C  2.052133 -3.452904 -1.9434
H  2.310306 2.529784 -0.737728
H  0.647059 2.171318 1.847596
H  1.824687 0.238917 -1.310594
H  3.147796 -0.513631 -0.437254
H  1.489695 -0.968616 -0.065641
H  2.601655 1.235173 2.832231
H  2.192813 -0.423874 2.400006
H  3.75171 0.253053 1.931851
H  2.490646 3.853471 1.950649
H  6.030565 2.496687 0.387194
H  4.641868 2.254857 -0.668929
H  5.585988 3.742612 -0.757338
H  5.870379 4.227937 2.340013
H  5.400527 5.482254 1.21329
H  4.34732 5.091025 2.57485
H  -2.404636 1.547656 -1.187898
H  -1.007272 -0.928933 -0.053182
H  -5.120699 0.327831 0.033882
H  -5.819003 -2.022096 0.092342
H  -4.14068 -3.836922 0.046532
H  0.620798 -4.340922 1.002468
H  -1.177024 -2.552535 -2.457227
H  2.805795 -4.36295 -0.151369
H  1.004673 -2.55076 -3.585696
H  3.009285 -3.45497 -2.448061
elementType: O N C H
totalener: -1210.10527827 hartree
nucrepener: 2528.26062229 hartree
electener: -3738.36590057 hartree
oneelecener: -6667.36443590 hartree
twoeener: 2928.99853533 hartree
cpcmener: -0.02850189 hartree
kineticenergy: 1204.69604008 hartree
xcener: -118.583575196482 hartree
chargesum: 0.0000000
charge: -0.283786 -0.434308 -0.324965 -0.087942 0.175714 -0.017939 -0.123530 -0.300541 -0.278757 -0.254510 0.383732 -0.039165 -0.247024 -0.228676 0.416579 -0.026903 -0.215826 -0.172335 -0.212569 0.263325 -0.108431 -0.238454 0.263386 -0.213720 -0.184472 -0.135987 -0.144130 -0.178655 0.103001 0.096314 0.103969 0.107859 0.056251 0.094616 0.101003 0.098452 0.120016 0.096037 0.086028 0.101034 0.093303 0.094991 0.089250 0.136128 0.157740 0.137845 0.158916 0.146185 0.144666 0.155772 0.155683 0.158492 0.156339
qa: -0.2838 -0.4343 -0.3250 -0.0879 0.1757 -0.0179 -0.1235 -0.3005 -0.2788 -0.2545 0.3837 -0.0392 -0.2470 -0.2287 0.4166 -0.0269 -0.2158 -0.1723 -0.2126 0.2633 -0.1084 -0.2385 0.2634 -0.2137 -0.1845 -0.1360 -0.1441 -0.1787 0.1030 0.0963 0.1040 0.1079 0.0563 0.0946 0.1010 0.0985 0.1200 0.0960 0.0860 0.1010 0.0933 0.0950 0.0893 0.1361 0.1577 0.1378 0.1589 0.1462 0.1447 0.1558 0.1557 0.1585 0.1563
va: 2.1146 2.0833 2.0881 3.1067 3.6638 3.8196 3.8610 3.8926 3.9048 3.8601 4.2252 3.7086 3.9367 3.9292 3.7289 3.7992 4.0569 3.9370 3.9630 3.7602 3.9257 4.0113 3.7020 3.9544 3.8991 3.8682 3.8515 3.8563 1.0234 1.0357 1.0138 1.0028 1.0142 1.0027 1.0021 1.0008 1.0070 0.9979 1.0090 0.9988 0.9965 0.9955 1.0076 1.0279 0.9680 1.0140 0.9897 1.0069 1.0078 0.9962 0.9905 0.9912 0.9917
dispcorr: -0.028540436 hartree
energy: -1210.133818708356
dipole: 37.54241 -35.66562 1.87679 8.80127 -10.04985 -1.24858 4.19078 -4.34802 -0.15723
magnitude: 2.25965 au
magnitude: 5.74358 debye
