program: Orca
programVersion: 5.0.2
elementType: O O O N C C C C C C C C C C C C C C C C C C C C C C C C H H H H H H H H H H H H H H H H H H H H H H H H H
charge: 0
multiplicity: 1
keywords: wb97x-d3
keywords: def2-TZVPP
keywords: def2/J RIJCOSX
keywords: DEFGRID2
keywords: scfconv7
keywords: smallprint printgap noloewdin
keywords: NOSOSCF
formula: C24H25NO3
InChI: InChI=1/C24H25NO3/c1-16(2)13-20-22(24(20,3)4)23(26)28-21(15-25)17-9-8-12-19(14-17)27-18-10-6-5-7-11-18/h5-14,20-22H,1-4H3
53 atoms
O  -0.803911 1.685238 0.774796
O  0.223568 1.824069 -1.212819
O  -1.219871 -3.168848 -1.764621
N  -3.976969 2.375618 1.363861
C  2.802114 2.024749 0.588427
C  2.404096 3.390348 0.153049
C  1.362034 2.486187 0.789124
C  3.147155 0.996096 -0.459299
C  3.589082 1.85795 1.865913
C  2.849992 4.613958 0.868531
C  0.248106 1.974631 -0.017057
C  2.113317 5.715162 1.035385
C  0.709176 5.849223 0.531644
C  2.647839 6.907505 1.76777
C  -1.987303 1.180032 0.164629
C  -2.053721 -0.320978 0.297216
C  -3.09787 1.848483 0.845801
C  -1.613317 -1.09669 -0.765995
C  -2.482473 -0.924843 1.473367
C  -1.615386 -2.480813 -0.658363
C  -2.490195 -2.308058 1.562878
C  -2.06546 -3.095836 0.503662
C  -0.595916 -4.382905 -1.667679
C  -0.920271 -5.326262 -2.632524
C  0.369443 -4.655121 -0.705408
C  -0.275319 -6.554334 -2.631908
C  0.995259 -5.893935 -0.708815
C  0.678469 -6.847467 -1.666919
H  2.283954 3.498611 -0.922978
H  1.100267 2.714137 1.815882
H  2.906184 -0.013224 -0.119775
H  2.642571 1.162723 -1.408294
H  4.220993 1.027185 -0.654948
H  3.297956 2.573479 2.635063
H  3.440624 0.85678 2.275015
H  4.658178 1.982202 1.681216
H  3.861672 4.603173 1.265053
H  0.576703 6.797901 0.005782
H  0.415087 5.04971 -0.14668
H  -0.001362 5.858253 1.363317
H  2.001983 7.172852 2.609049
H  3.652197 6.736875 2.15579
H  2.682133 7.785606 1.117461
H  -2.039411 1.465202 -0.889945
H  -1.274903 -0.63268 -1.684477
H  -2.822253 -0.331494 2.313351
H  -2.841644 -2.785405 2.468076
H  -2.096743 -4.174302 0.589792
H  -1.667408 -5.094415 -3.381355
H  0.639692 -3.916378 0.038722
H  -0.527507 -7.285838 -3.388773
H  1.743934 -6.108593 0.042974
H  1.174618 -7.809046 -1.663693
elementType: O N C H
totalener: -1210.10546385 hartree
nucrepener: 2427.08985642 hartree
electener: -3637.19532027 hartree
oneelecener: -6465.43215419 hartree
twoeener: 2828.23683391 hartree
cpcmener: -0.02772832 hartree
kineticenergy: 1204.70322705 hartree
xcener: -118.581226656899 hartree
chargesum: -0.0000000
charge: -0.279177 -0.459023 -0.322849 -0.091396 0.148056 -0.013163 -0.121166 -0.279198 -0.283725 -0.296193 0.408768 -0.006610 -0.244476 -0.226978 0.388011 0.002311 -0.215662 -0.206041 -0.202584 0.274169 -0.138163 -0.195995 0.303528 -0.254187 -0.211301 -0.118210 -0.140101 -0.186661 0.105457 0.093254 0.099240 0.093708 0.096466 0.093634 0.098296 0.099242 0.121478 0.100482 0.082194 0.102378 0.093859 0.089092 0.096154 0.131435 0.132705 0.141149 0.161249 0.158334 0.145603 0.157759 0.157417 0.159279 0.158152
qa: -0.2792 -0.4590 -0.3228 -0.0914 0.1481 -0.0132 -0.1212 -0.2792 -0.2837 -0.2962 0.4088 -0.0066 -0.2445 -0.2270 0.3880 0.0023 -0.2157 -0.2060 -0.2026 0.2742 -0.1382 -0.1960 0.3035 -0.2542 -0.2113 -0.1182 -0.1401 -0.1867 0.1055 0.0933 0.0992 0.0937 0.0965 0.0936 0.0983 0.0992 0.1215 0.1005 0.0822 0.1024 0.0939 0.0891 0.0962 0.1314 0.1327 0.1411 0.1612 0.1583 0.1456 0.1578 0.1574 0.1593 0.1582
va: 2.1121 2.0496 2.0854 3.1091 3.7069 3.8175 3.8274 3.8940 3.9086 3.8930 4.1420 3.7024 3.9384 3.9329 3.7423 3.7041 4.0681 4.0293 3.9991 3.7720 3.9216 3.9353 3.6727 4.0112 3.9190 3.8831 3.8868 3.9087 1.0227 1.0315 0.9997 1.0175 1.0009 1.0018 1.0030 0.9998 1.0035 1.0001 1.0127 0.9979 0.9962 1.0064 0.9963 1.0258 1.0305 1.0099 0.9909 0.9950 1.0088 0.9970 0.9893 0.9902 0.9905
dispcorr: -0.024855450 hartree
energy: -1210.130319299815
dipole: 26.21976 -24.53527 1.68449 19.87906 -20.98143 -1.10237 7.68579 -7.11945 0.56634
magnitude: 2.09128 au
magnitude: 5.31562 debye
