program: Orca
programVersion: 5.0.2
elementType: O O O N C C C C C C C C C C C C C C C C C C C C C C C C H H H H H H H H H H H H H H H H H H H H H H H H H
charge: 0
multiplicity: 1
keywords: wb97x-d3
keywords: def2-TZVPP
keywords: def2/J RIJCOSX
keywords: DEFGRID2
keywords: scfconv7
keywords: smallprint printgap noloewdin
keywords: NOSOSCF
formula: C24H25NO3
InChI: InChI=1/C24H25NO3/c1-16(2)13-20-22(24(20,3)4)23(26)28-21(15-25)17-9-8-12-19(14-17)27-18-10-6-5-7-11-18/h5-14,20-22H,1-4H3
53 atoms
O  -0.899554 1.290119 -0.168794
O  -0.867639 3.186782 1.006627
O  -1.539742 -3.594262 -1.367514
N  -1.973918 0.534613 2.960024
C  1.466352 3.916605 -1.006415
C  2.034152 3.472808 0.295308
C  0.995314 2.603886 -0.390348
C  0.554956 5.11826 -1.036093
C  2.29127 3.762694 -2.260992
C  3.428664 2.979048 0.437301
C  -0.324755 2.443565 0.227058
C  3.801205 1.946234 1.197788
C  2.84119 1.119344 1.997622
C  5.23542 1.524803 1.294358
C  -2.162191 0.970824 0.384316
C  -2.675627 -0.288633 -0.270926
C  -2.039568 0.748592 1.833285
C  -1.814333 -1.356014 -0.501237
C  -4.020188 -0.377476 -0.597661
C  -2.318822 -2.520893 -1.061784
C  -4.508692 -1.550744 -1.156503
C  -3.667547 -2.624458 -1.387131
C  -0.380325 -3.838551 -0.678185
C  -0.352802 -3.881515 0.710268
C  0.758668 -4.108391 -1.421461
C  0.838017 -4.186949 1.352543
C  1.939771 -4.427418 -0.765676
C  1.986493 -4.460918 0.620716
H  1.645197 4.012416 1.156469
H  1.368322 1.71284 -0.882184
H  -0.185401 5.033511 -1.834234
H  0.024795 5.279228 -0.099761
H  1.144494 6.016383 -1.23163
H  1.644545 3.69751 -3.138039
H  2.946087 4.625611 -2.399027
H  2.916639 2.869894 -2.245796
H  4.1945 3.52636 -0.105761
H  2.730673 0.122708 1.560113
H  3.21637 0.968654 3.012714
H  1.848315 1.55904 2.076034
H  5.597859 1.604294 2.322688
H  5.355831 0.477011 1.005968
H  5.886852 2.12601 0.660093
H  -2.877663 1.785047 0.233822
H  -0.764322 -1.276697 -0.248841
H  -4.683592 0.45887 -0.418374
H  -5.55692 -1.629927 -1.41247
H  -4.04707 -3.54042 -1.822221
H  -1.247083 -3.682482 1.288292
H  0.718048 -4.076355 -2.503061
H  0.86294 -4.218164 2.434174
H  2.827652 -4.644035 -1.345717
H  2.910373 -4.703819 1.1290
elementType: O N C H
totalener: -1210.10636203 hartree
nucrepener: 2494.88490263 hartree
electener: -3704.99126466 hartree
oneelecener: -6601.23148693 hartree
twoeener: 2896.24022227 hartree
cpcmener: -0.03064792 hartree
kineticenergy: 1204.70441176 hartree
xcener: -118.582252193504 hartree
chargesum: -0.0000000
charge: -0.287292 -0.449199 -0.324439 -0.095604 0.144248 -0.008838 -0.103607 -0.278292 -0.281638 -0.301674 0.382748 -0.008209 -0.236692 -0.227660 0.417565 0.006393 -0.232891 -0.188727 -0.204714 0.251929 -0.116849 -0.230761 0.279369 -0.195931 -0.238695 -0.141802 -0.124611 -0.180303 0.106741 0.096680 0.099518 0.094025 0.095828 0.098147 0.099126 0.093195 0.121608 0.101351 0.101127 0.081268 0.096527 0.094180 0.088359 0.133839 0.143945 0.144295 0.158042 0.147217 0.157542 0.146606 0.160113 0.158112 0.158789
qa: -0.2873 -0.4492 -0.3244 -0.0956 0.1442 -0.0088 -0.1036 -0.2783 -0.2816 -0.3017 0.3827 -0.0082 -0.2367 -0.2277 0.4176 0.0064 -0.2329 -0.1887 -0.2047 0.2519 -0.1168 -0.2308 0.2794 -0.1959 -0.2387 -0.1418 -0.1246 -0.1803 0.1067 0.0967 0.0995 0.0940 0.0958 0.0981 0.0991 0.0932 0.1216 0.1014 0.1011 0.0813 0.0965 0.0942 0.0884 0.1338 0.1439 0.1443 0.1580 0.1472 0.1575 0.1466 0.1601 0.1581 0.1588
va: 2.1419 2.0543 2.0869 3.1078 3.7080 3.8099 3.8343 3.8947 3.9083 3.8978 4.1456 3.7062 3.9379 3.9333 3.7367 3.7565 4.0050 3.9345 3.9680 3.7792 3.9102 3.9975 3.6892 3.9263 4.0128 3.8851 3.8829 3.9034 1.0240 1.0253 0.9995 1.0166 1.0012 1.0032 1.0002 1.0021 1.0043 0.9986 1.0008 1.0126 0.9963 0.9963 1.0064 1.0206 1.0201 1.0038 0.9897 1.0060 0.9967 1.0073 0.9899 0.9893 0.9903
dispcorr: -0.025516572 hartree
energy: -1210.131878599919
dipole: 26.96562 -26.20269 0.76293 16.77232 -17.03278 -0.26047 -2.87148 0.89603 -1.97545
magnitude: 2.13362 au
magnitude: 5.42322 debye
