program: Orca
programVersion: 5.0.2
elementType: O O O N C C C C C C C C C C C C C C C C C C C C C C C C H H H H H H H H H H H H H H H H H H H H H H H H H
charge: 0
multiplicity: 1
keywords: wb97x-d3
keywords: def2-TZVPP
keywords: def2/J RIJCOSX
keywords: DEFGRID2
keywords: scfconv7
keywords: smallprint printgap noloewdin
keywords: NOSOSCF
formula: C24H25NO3
InChI: InChI=1/C24H25NO3/c1-16(2)13-20-22(24(20,3)4)23(26)28-21(15-25)17-9-8-12-19(14-17)27-18-10-6-5-7-11-18/h5-14,20-22H,1-4H3
53 atoms
O  -0.820307 1.153428 -0.022556
O  -0.868145 3.167413 0.938394
O  -1.92593 -3.876094 -0.711156
N  -2.110693 0.516692 3.030972
C  1.487008 3.614154 -1.177791
C  2.001326 3.55816 0.218336
C  1.08028 2.458589 -0.268587
C  0.490001 4.683289 -1.547055
C  2.399698 3.229452 -2.316738
C  3.42086 3.256398 0.537529
C  -0.274759 2.345594 0.285503
C  3.832327 2.574647 1.609739
C  2.896014 1.989711 2.621878
C  5.287597 2.334903 1.871496
C  -2.139324 0.905557 0.442094
C  -2.662158 -0.314063 -0.271836
C  -2.118059 0.695934 1.896245
C  -2.004604 -1.53229 -0.13506
C  -3.790154 -0.201795 -1.070508
C  -2.48315 -2.638616 -0.821538
C  -4.266114 -1.322084 -1.738324
C  -3.614803 -2.537165 -1.624347
C  -0.580031 -4.028855 -0.505703
C  -0.186212 -4.978323 0.425919
C  0.361972 -3.321879 -1.243275
C  1.165848 -5.225478 0.617809
C  1.710334 -3.570238 -1.030975
C  2.118896 -4.519957 -0.103357
H  1.515393 4.255536 0.897421
H  1.542028 1.508341 -0.513041
H  1.019101 5.560944 -1.9226
H  -0.179521 4.342931 -2.339264
H  -0.119673 5.010169 -0.707141
H  3.088765 2.428526 -2.049557
H  1.817218 2.889404 -3.175179
H  2.993475 4.086002 -2.641592
H  4.169439 3.64982 -0.144919
H  3.19193 2.277919 3.633796
H  1.859753 2.292979 2.480393
H  2.93014 0.896526 2.592736
H  5.50361 1.265119 1.935448
H  5.922679 2.760622 1.094399
H  5.59022 2.767575 2.828743
H  -2.794881 1.758122 0.243369
H  -1.134975 -1.615058 0.50663
H  -4.294939 0.750355 -1.171991
H  -5.146546 -1.244676 -2.362284
H  -3.980506 -3.41042 -2.149565
H  -0.933204 -5.523753 0.989414
H  0.054726 -2.589606 -1.979935
H  1.47163 -5.970531 1.341147
H  2.445355 -3.020146 -1.604543
H  3.172424 -4.711748 0.052361
elementType: O N C H
totalener: -1210.10698321 hartree
nucrepener: 2476.51801211 hartree
electener: -3686.62499532 hartree
oneelecener: -6564.38740494 hartree
twoeener: 2877.76240961 hartree
cpcmener: -0.03117317 hartree
kineticenergy: 1204.70407107 hartree
xcener: -118.580649021085 hartree
chargesum: -0.0000000
charge: -0.281823 -0.451384 -0.325361 -0.089732 0.144635 -0.020554 -0.098917 -0.272703 -0.286251 -0.293832 0.386099 -0.012790 -0.239321 -0.227557 0.430903 0.002770 -0.237775 -0.203916 -0.187086 0.246470 -0.119264 -0.228644 0.278723 -0.245331 -0.193096 -0.119063 -0.140279 -0.184028 0.105312 0.096422 0.097332 0.099470 0.092949 0.093523 0.098479 0.099992 0.122477 0.099528 0.079789 0.100642 0.093936 0.089242 0.096146 0.123311 0.150290 0.146249 0.158783 0.148268 0.145901 0.156209 0.157441 0.159297 0.158119
qa: -0.2818 -0.4514 -0.3254 -0.0897 0.1446 -0.0206 -0.0989 -0.2727 -0.2863 -0.2938 0.3861 -0.0128 -0.2393 -0.2276 0.4309 0.0028 -0.2378 -0.2039 -0.1871 0.2465 -0.1193 -0.2286 0.2787 -0.2453 -0.1931 -0.1191 -0.1403 -0.1840 0.1053 0.0964 0.0973 0.0995 0.0929 0.0935 0.0985 0.1000 0.1225 0.0995 0.0798 0.1006 0.0939 0.0892 0.0961 0.1233 0.1503 0.1462 0.1588 0.1483 0.1459 0.1562 0.1574 0.1593 0.1581
va: 2.1602 2.0522 2.0830 3.1095 3.7180 3.8217 3.8236 3.8940 3.9090 3.8917 4.1501 3.7083 3.9364 3.9317 3.7310 3.7378 4.0206 3.9570 3.9350 3.7861 3.9112 4.0049 3.6959 4.0143 3.9222 3.8832 3.8887 3.9078 1.0256 1.0271 1.0011 0.9996 1.0152 1.0017 1.0031 0.9997 1.0033 1.0006 1.0164 0.9980 0.9964 1.0063 0.9965 1.0254 1.0120 1.0019 0.9899 1.0054 1.0080 0.9971 0.9894 0.9903 0.9905
dispcorr: -0.025001153 hartree
energy: -1210.131984363357
dipole: 28.29113 -27.31792 0.97321 18.88864 -19.06930 -0.18066 -3.98561 1.63241 -2.35319
magnitude: 2.55290 au
magnitude: 6.48895 debye
