program: Orca
programVersion: 5.0.2
elementType: O O O N C C C C C C C C C C C C C C C C C C C C C C C C H H H H H H H H H H H H H H H H H H H H H H H H H
charge: 0
multiplicity: 1
keywords: wb97x-d3
keywords: def2-TZVPP
keywords: def2/J RIJCOSX
keywords: DEFGRID2
keywords: scfconv7
keywords: smallprint printgap noloewdin
keywords: NOSOSCF
formula: C24H25NO3
InChI: InChI=1/C24H25NO3/c1-16(2)13-20-22(24(20,3)4)23(26)28-21(15-25)17-9-8-12-19(14-17)27-18-10-6-5-7-11-18/h5-14,20-22H,1-4H3
53 atoms
O  -0.477982 1.51601 -0.031516
O  -1.095083 3.526313 0.713888
O  -0.047902 -3.407969 -0.639416
N  -2.293759 0.852834 2.744523
C  1.54661 4.294917 -0.921963
C  1.728539 4.448542 0.548717
C  1.167571 3.149929 0.012198
C  0.474725 5.097138 -1.616503
C  2.753562 4.032368 -1.788837
C  3.072127 4.476886 1.183352
C  -0.234904 2.804472 0.275332
C  3.383011 3.903056 2.348345
C  2.407762 3.114532 3.167277
C  4.762643 4.00216 2.924039
C  -1.795224 1.037604 0.180626
C  -1.920715 -0.324749 -0.455159
C  -2.065211 0.950936 1.623167
C  -0.939919 -1.286133 -0.248008
C  -3.038258 -0.612344 -1.226102
C  -1.074071 -2.535416 -0.836545
C  -3.162961 -1.869277 -1.799905
C  -2.18622 -2.834777 -1.617524
C  -0.278479 -4.759014 -0.716168
C  0.481485 -5.500052 -1.607079
C  -1.205145 -5.373248 0.116555
C  0.314199 -6.877598 -1.660726
C  -1.369385 -6.748433 0.045702
C  -0.612457 -7.504872 -0.840351
H  0.980837 5.079444 1.024984
H  1.839467 2.299282 -0.015911
H  -0.369368 5.336132 -0.972258
H  0.893472 6.043791 -1.963576
H  0.092893 4.568185 -2.492171
H  2.463179 3.508457 -2.701629
H  3.226468 4.971053 -2.085307
H  3.506289 3.424802 -1.286212
H  3.842447 5.038054 0.661072
H  1.384335 3.174926 2.801167
H  2.691212 2.05849 3.195447
H  2.409591 3.459598 4.204206
H  5.442677 4.553849 2.274846
H  4.746613 4.499469 3.897422
H  5.188641 3.009471 3.092957
H  -2.537516 1.71497 -0.252371
H  -0.069486 -1.079012 0.363336
H  -3.802852 0.13786 -1.383277
H  -4.027041 -2.099026 -2.409261
H  -2.293912 -3.803292 -2.088479
H  1.199564 -5.004423 -2.248449
H  -1.788472 -4.787686 0.816846
H  0.908171 -7.458997 -2.354085
H  -2.089734 -7.230883 0.693728
H  -0.743282 -8.577979 -0.888029
elementType: O N C H
totalener: -1210.10670441 hartree
nucrepener: 2400.67968377 hartree
electener: -3610.78638818 hartree
oneelecener: -6412.90525209 hartree
twoeener: 2802.11886390 hartree
cpcmener: -0.03089291 hartree
kineticenergy: 1204.70860762 hartree
xcener: -118.581596688815 hartree
chargesum: -0.0000000
charge: -0.282918 -0.449002 -0.325033 -0.092259 0.142589 -0.010333 -0.106702 -0.273340 -0.285278 -0.297726 0.385835 -0.013537 -0.236328 -0.227708 0.418209 0.000799 -0.233973 -0.217370 -0.182797 0.227133 -0.149501 -0.165771 0.234707 -0.214986 -0.168049 -0.136876 -0.150750 -0.165020 0.105292 0.099577 0.092720 0.096845 0.099475 0.098665 0.099556 0.094034 0.121543 0.079407 0.100501 0.100052 0.088542 0.096589 0.094066 0.128882 0.135933 0.145972 0.159841 0.155200 0.147843 0.159230 0.157825 0.159676 0.158721
qa: -0.2829 -0.4490 -0.3250 -0.0923 0.1426 -0.0103 -0.1067 -0.2733 -0.2853 -0.2977 0.3858 -0.0135 -0.2363 -0.2277 0.4182 0.0008 -0.2340 -0.2174 -0.1828 0.2271 -0.1495 -0.1658 0.2347 -0.2150 -0.1680 -0.1369 -0.1507 -0.1650 0.1053 0.0996 0.0927 0.0968 0.0995 0.0987 0.0996 0.0940 0.1215 0.0794 0.1005 0.1001 0.0885 0.0966 0.0941 0.1289 0.1359 0.1460 0.1598 0.1552 0.1478 0.1592 0.1578 0.1597 0.1587
va: 2.1523 2.0545 2.0752 3.1103 3.7173 3.8092 3.8270 3.8957 3.9066 3.8938 4.1529 3.7104 3.9353 3.9319 3.7282 3.7614 4.0132 4.0682 3.9525 3.8162 3.9301 3.8889 3.7237 3.9982 3.9242 3.8906 3.8913 3.8902 1.0260 1.0244 1.0151 1.0010 0.9998 1.0032 1.0000 1.0021 1.0040 1.0158 0.9983 1.0007 1.0065 0.9964 0.9965 1.0240 1.0294 1.0026 0.9918 0.9974 1.0057 0.9953 0.9897 0.9901 0.9900
dispcorr: -0.024537482 hartree
energy: -1210.131241896758
dipole: 22.14614 -21.41160 0.73454 21.32221 -22.29935 -0.97714 -0.34675 -1.90488 -2.25162
magnitude: 2.56206 au
magnitude: 6.51225 debye
