program: Orca
programVersion: 5.0.2
elementType: O O O N C C C C C C C C C C C C C C C C C C C C C C C C H H H H H H H H H H H H H H H H H H H H H H H H H
charge: 0
multiplicity: 1
keywords: wb97x-d3
keywords: def2-TZVPP
keywords: def2/J RIJCOSX
keywords: DEFGRID2
keywords: scfconv7
keywords: smallprint printgap noloewdin
keywords: NOSOSCF
formula: C24H25NO3
InChI: InChI=1/C24H25NO3/c1-16(2)13-20-22(24(20,3)4)23(26)28-21(15-25)17-9-8-12-19(14-17)27-18-10-6-5-7-11-18/h5-14,20-22H,1-4H3
53 atoms
O  -0.917769 1.239266 -0.151291
O  -0.918967 3.259814 0.795025
O  -1.773693 -3.789427 -0.58184
N  -2.312357 0.850202 2.914566
C  1.606451 3.690237 -1.059003
C  2.051136 3.364264 0.323934
C  1.033711 2.466137 -0.354664
C  0.753422 4.911897 -1.291894
C  2.523305 3.375602 -2.216148
C  3.412334 2.843191 0.61397
C  -0.33937 2.416212 0.157644
C  3.693679 1.819776 1.42444
C  2.653274 1.0331 2.161839
C  5.105338 1.368677 1.645406
C  -2.244926 1.026509 0.302583
C  -2.736104 -0.265816 -0.299249
C  -2.267989 0.946164 1.770193
C  -1.98848 -1.426752 -0.131731
C  -3.924554 -0.282782 -1.012217
C  -2.432679 -2.605669 -0.711364
C  -4.36911 -1.477382 -1.564162
C  -3.626422 -2.635906 -1.425933
C  -0.41588 -3.817831 -0.394748
C  0.44923 -3.097032 -1.2091
C  0.072233 -4.649393 0.601617
C  1.81679 -3.206769 -1.005396
C  1.443784 -4.760678 0.784554
C  2.319793 -4.03597 -0.010853
H  1.62324 4.004596 1.092675
H  1.406197 1.515925 -0.720155
H  0.062828 4.75827 -2.12366
H  0.172398 5.204728 -0.420084
H  1.394167 5.757072 -1.55183
H  3.109215 2.470916 -2.052144
H  1.94833 3.234996 -3.133431
H  3.221445 4.197516 -2.388297
H  4.236827 3.360662 0.130343
H  1.666065 1.490836 2.143364
H  2.562438 0.024487 1.747901
H  2.938929 0.909988 3.209371
H  5.222508 0.312849 1.386314
H  5.819689 1.941445 1.053872
H  5.387494 1.46031 2.697601
H  -2.901595 1.849888 0.005805
H  -1.072287 -1.40723 0.446722
H  -4.49939 0.625539 -1.139194
H  -5.296595 -1.501802 -2.120667
H  -3.965668 -3.564915 -1.866673
H  0.066795 -2.45938 -1.996583
H  -0.615524 -5.208504 1.223713
H  2.49245 -2.644118 -1.636727
H  1.824994 -5.413036 1.559527
H  3.388114 -4.119517 0.139236
elementType: O N C H
totalener: -1210.10655957 hartree
nucrepener: 2509.09868647 hartree
electener: -3719.20524604 hartree
oneelecener: -6629.48919388 hartree
twoeener: 2910.28394784 hartree
cpcmener: -0.03135466 hartree
kineticenergy: 1204.70852480 hartree
xcener: -118.582434396113 hartree
chargesum: -0.0000000
charge: -0.283515 -0.448970 -0.324589 -0.091151 0.136818 0.002452 -0.109045 -0.280480 -0.281491 -0.302407 0.383237 -0.011813 -0.232813 -0.227193 0.424257 0.003628 -0.234145 -0.205909 -0.196421 0.256286 -0.112997 -0.234287 0.278010 -0.192569 -0.240731 -0.143845 -0.120976 -0.181452 0.106940 0.096663 0.099566 0.093898 0.095839 0.092772 0.098458 0.099247 0.120807 0.082916 0.099420 0.102059 0.093353 0.088759 0.096930 0.126113 0.147924 0.145921 0.158247 0.147399 0.157154 0.146289 0.158854 0.158287 0.158295
qa: -0.2835 -0.4490 -0.3246 -0.0912 0.1368 0.0025 -0.1090 -0.2805 -0.2815 -0.3024 0.3832 -0.0118 -0.2328 -0.2272 0.4243 0.0036 -0.2341 -0.2059 -0.1964 0.2563 -0.1130 -0.2343 0.2780 -0.1926 -0.2407 -0.1438 -0.1210 -0.1815 0.1069 0.0967 0.0996 0.0939 0.0958 0.0928 0.0985 0.0992 0.1208 0.0829 0.0994 0.1021 0.0934 0.0888 0.0969 0.1261 0.1479 0.1459 0.1582 0.1474 0.1572 0.1463 0.1589 0.1583 0.1583
va: 2.1495 2.0561 2.0852 3.1081 3.7122 3.8015 3.8436 3.8973 3.9072 3.8962 4.1421 3.7124 3.9356 3.9325 3.7474 3.7391 4.0158 3.9452 3.9461 3.7834 3.9072 4.0048 3.6933 3.9218 4.0152 3.8820 3.8811 3.9037 1.0229 1.0237 0.9992 1.0170 1.0009 1.0027 1.0030 1.0005 1.0046 1.0110 0.9989 1.0006 0.9967 1.0064 0.9966 1.0224 1.0153 1.0027 0.9898 1.0061 0.9965 1.0075 0.9904 0.9892 0.9905
dispcorr: -0.025868816 hartree
energy: -1210.132428383431
dipole: 28.54824 -27.46041 1.08783 15.51737 -15.93142 -0.41405 -4.19414 1.86998 -2.32416
magnitude: 2.59933 au
magnitude: 6.60698 debye
