program: Orca
programVersion: 5.0.2
elementType: O O O N C C C C C C C C C C C C C C C C C C C C C C C C H H H H H H H H H H H H H H H H H H H H H H H H H
charge: 0
multiplicity: 1
keywords: wb97x-d3
keywords: def2-TZVPP
keywords: def2/J RIJCOSX
keywords: DEFGRID2
keywords: scfconv7
keywords: smallprint printgap noloewdin
keywords: NOSOSCF
formula: C24H25NO3
InChI: InChI=1/C24H25NO3/c1-16(2)13-20-22(24(20,3)4)23(26)28-21(15-25)17-9-8-12-19(14-17)27-18-10-6-5-7-11-18/h5-14,20-22H,1-4H3
53 atoms
O  -0.918226 1.304005 -0.346527
O  -0.843601 3.151889 0.899032
O  -1.555131 -3.712584 -1.157939
N  -1.951143 0.544448 2.810299
C  1.466373 3.993713 -1.06331
C  2.062756 3.379804 0.151902
C  0.9615 2.634835 -0.595805
C  0.60945 5.226769 -0.916385
C  2.240755 3.963028 -2.359786
C  3.437287 2.820509 0.188519
C  -0.332248 2.445215 0.065909
C  3.848135 1.873426 1.036208
C  2.951293 1.225711 2.0453
C  5.262583 1.381184 1.030183
C  -2.166349 0.968946 0.23507
C  -2.665511 -0.301764 -0.407286
C  -2.020357 0.754713 1.682771
C  -1.826779 -1.410114 -0.476066
C  -3.963431 -0.361237 -0.888394
C  -2.309512 -2.588994 -1.023915
C  -4.429251 -1.547935 -1.441003
C  -3.613043 -2.661887 -1.507738
C  -0.44899 -3.90687 -0.369335
C  0.758199 -4.159969 -1.000913
C  -0.546464 -3.915241 1.016286
C  1.882289 -4.434301 -0.233318
C  0.586801 -4.178306 1.771113
C  1.802539 -4.439656 1.151782
H  1.717483 3.816531 1.085824
H  1.283008 1.794735 -1.200184
H  -0.163179 5.263788 -1.686933
H  0.122843 5.300638 0.053466
H  1.232269 6.115655 -1.035041
H  1.562862 4.048053 -3.21098
H  2.939044 4.801019 -2.409698
H  2.813337 3.044413 -2.48817
H  4.156728 3.235648 -0.511532
H  3.329804 1.387576 3.058246
H  1.925258 1.589411 2.0132
H  2.925147 0.142476 1.898523
H  5.302998 0.307788 0.826251
H  5.872921 1.888688 0.283109
H  5.733995 1.526693 2.005863
H  -2.895223 1.772385 0.09037
H  -0.812096 -1.349675 -0.101512
H  -4.60866 0.505949 -0.831678
H  -5.44133 -1.605261 -1.819118
H  -3.976553 -3.588371 -1.93425
H  0.815387 -4.151295 -2.08219
H  -1.495064 -3.724277 1.503332
H  2.824712 -4.638823 -0.724806
H  0.514286 -4.186301 2.850977
H  2.681459 -4.649899 1.746899
elementType: O N C H
totalener: -1210.10661912 hartree
nucrepener: 2491.32615239 hartree
electener: -3701.43277151 hartree
oneelecener: -6594.29091209 hartree
twoeener: 2892.85814058 hartree
cpcmener: -0.03107158 hartree
kineticenergy: 1204.70864574 hartree
xcener: -118.582677934239 hartree
chargesum: -0.0000000
charge: -0.288673 -0.452024 -0.323824 -0.095908 0.155690 -0.034379 -0.087650 -0.274992 -0.290104 -0.285066 0.386227 -0.007853 -0.238139 -0.228255 0.431171 -0.005877 -0.233794 -0.197491 -0.199578 0.251812 -0.114745 -0.230599 0.264934 -0.224788 -0.192097 -0.130777 -0.140811 -0.174784 0.106145 0.092420 0.098953 0.094983 0.094841 0.098460 0.100851 0.092278 0.123874 0.101058 0.077326 0.095467 0.094930 0.089343 0.094953 0.130356 0.143752 0.145137 0.157941 0.147265 0.147253 0.157488 0.158350 0.160183 0.158767
qa: -0.2887 -0.4520 -0.3238 -0.0959 0.1557 -0.0344 -0.0877 -0.2750 -0.2901 -0.2851 0.3862 -0.0079 -0.2381 -0.2283 0.4312 -0.0059 -0.2338 -0.1975 -0.1996 0.2518 -0.1147 -0.2306 0.2649 -0.2248 -0.1921 -0.1308 -0.1408 -0.1748 0.1061 0.0924 0.0990 0.0950 0.0948 0.0985 0.1009 0.0923 0.1239 0.1011 0.0773 0.0955 0.0949 0.0893 0.0950 0.1304 0.1438 0.1451 0.1579 0.1473 0.1473 0.1575 0.1584 0.1602 0.1588
va: 2.1489 2.0498 2.0869 3.1085 3.7105 3.8389 3.8338 3.8844 3.9155 3.8860 4.1370 3.7071 3.9436 3.9297 3.7369 3.7639 4.0134 3.9327 3.9519 3.7858 3.9133 3.9987 3.6970 4.0099 3.9360 3.8842 3.8864 3.8977 1.0228 1.0297 0.9996 1.0176 1.0010 1.0031 0.9989 1.0011 1.0031 0.9994 1.0144 0.9994 0.9965 1.0065 0.9961 1.0202 1.0207 1.0037 0.9899 1.0062 1.0062 0.9967 0.9894 0.9896 0.9903
dispcorr: -0.025223441 hartree
energy: -1210.131842559423
dipole: 27.12378 -26.36031 0.76347 17.54509 -17.75348 -0.20840 -2.70926 0.74595 -1.96330
magnitude: 2.11681 au
magnitude: 5.38050 debye
