program: Orca
programVersion: 5.0.2
elementType: O O O N C C C C C C C C C C C C C C C C C C C C C C C C H H H H H H H H H H H H H H H H H H H H H H H H H
charge: 0
multiplicity: 1
keywords: wb97x-d3
keywords: def2-TZVPP
keywords: def2/J RIJCOSX
keywords: DEFGRID2
keywords: scfconv7
keywords: smallprint printgap noloewdin
keywords: NOSOSCF
formula: C24H25NO3
InChI: InChI=1/C24H25NO3/c1-16(2)13-20-22(24(20,3)4)23(26)28-21(15-25)17-9-8-12-19(14-17)27-18-10-6-5-7-11-18/h5-14,20-22H,1-4H3
53 atoms
O  -0.52005 1.563659 -0.104355
O  -1.107276 3.560811 0.699429
O  0.001338 -3.340762 -0.730145
N  -2.026206 0.824202 2.831278
C  1.464882 4.483628 -0.923932
C  1.764627 4.388962 0.528289
C  1.10275 3.209545 -0.169368
C  0.383798 5.424904 -1.392468
C  2.589361 4.324639 -1.918501
C  3.131332 4.229301 1.081429
C  -0.272765 2.854958 0.189961
C  3.373909 3.590433 2.2293
C  2.263828 2.956357 3.021592
C  4.756713 3.461059 2.785695
C  -1.797508 1.051076 0.232343
C  -1.937725 -0.308965 -0.402999
C  -1.919225 0.945571 1.693885
C  -0.925058 -1.248776 -0.255567
C  -3.083155 -0.613503 -1.123395
C  -1.055927 -2.491119 -0.85589
C  -3.20457 -1.865924 -1.70978
C  -2.195997 -2.807645 -1.58917
C  -0.209787 -4.695287 -0.707541
C  0.570948 -5.481772 -1.540257
C  -1.130179 -5.268681 0.160978
C  0.42937 -6.862443 -1.500934
C  -1.269065 -6.648577 0.181578
C  -0.492858 -7.449758 -0.6465
H  1.075489 4.940115 1.165502
H  1.739799 2.359312 -0.384633
H  -0.096447 5.050003 -2.298496
H  -0.390128 5.596362 -0.646934
H  0.823322 6.395203 -1.63269
H  2.203795 3.982285 -2.880547
H  3.091873 5.279615 -2.086054
H  3.341408 3.60663 -1.590922
H  3.9568 4.672494 0.532126
H  1.474998 3.671962 3.26403
H  1.787265 2.143214 2.467555
H  2.625665 2.539387 3.961436
H  5.504818 3.929904 2.14623
H  4.825143 3.91758 3.776894
H  5.030535 2.410089 2.912536
H  -2.597946 1.708849 -0.11949
H  -0.031516 -1.026669 0.316155
H  -3.872144 0.1198 -1.232664
H  -4.090912 -2.108868 -2.280926
H  -2.29949 -3.771883 -2.070124
H  1.284852 -5.017295 -2.209003
H  -1.729077 -4.650074 0.818412
H  1.039736 -7.478207 -2.149012
H  -1.985369 -7.098662 0.856809
H  -0.604756 -8.525838 -0.622556
elementType: O N C H
totalener: -1210.10572475 hartree
nucrepener: 2409.23582960 hartree
electener: -3619.34155435 hartree
oneelecener: -6430.06164151 hartree
twoeener: 2810.72008716 hartree
cpcmener: -0.03088146 hartree
kineticenergy: 1204.71247245 hartree
xcener: -118.581950559458 hartree
chargesum: 0.0000000
charge: -0.283959 -0.451683 -0.326246 -0.092771 0.145968 -0.012624 -0.100272 -0.273513 -0.284246 -0.307580 0.379551 0.019544 -0.279699 -0.232383 0.423807 -0.001220 -0.233756 -0.216903 -0.182404 0.218285 -0.144176 -0.163726 0.247945 -0.226869 -0.171873 -0.130852 -0.148893 -0.171862 0.105839 0.098412 0.099404 0.092723 0.096131 0.098068 0.100532 0.091389 0.123437 0.100250 0.100652 0.102198 0.086056 0.098818 0.099109 0.126603 0.138460 0.146723 0.160379 0.156456 0.147319 0.158463 0.157160 0.159507 0.158323
qa: -0.2840 -0.4517 -0.3262 -0.0928 0.1460 -0.0126 -0.1003 -0.2735 -0.2842 -0.3076 0.3796 0.0195 -0.2797 -0.2324 0.4238 -0.0012 -0.2338 -0.2169 -0.1824 0.2183 -0.1442 -0.1637 0.2479 -0.2269 -0.1719 -0.1309 -0.1489 -0.1719 0.1058 0.0984 0.0994 0.0927 0.0961 0.0981 0.1005 0.0914 0.1234 0.1002 0.1007 0.1022 0.0861 0.0988 0.0991 0.1266 0.1385 0.1467 0.1604 0.1565 0.1473 0.1585 0.1572 0.1595 0.1583
va: 2.1452 2.0554 2.0738 3.1046 3.7443 3.8076 3.8202 3.8885 3.9102 3.8704 4.1490 3.6548 3.9617 3.9264 3.7289 3.7550 4.0145 4.0711 3.9509 3.8216 3.9217 3.8970 3.7129 4.0015 3.9132 3.8901 3.8909 3.8948 1.0232 1.0261 0.9995 1.0167 1.0009 1.0033 0.9994 1.0021 1.0036 0.9985 0.9959 1.0063 1.0076 0.9930 0.9933 1.0245 1.0271 1.0021 0.9914 0.9959 1.0065 0.9958 0.9897 0.9902 0.9902
dispcorr: -0.024777323 hartree
energy: -1210.130502075629
dipole: 20.95817 -20.43663 0.52154 20.96376 -21.84621 -0.88245 -0.34336 -1.85522 -2.19858
magnitude: 2.42579 au
magnitude: 6.16588 debye
