program: Orca
programVersion: 5.0.2
elementType: O O O N C C C C C C C C C C C C C C C C C C C C C C C C H H H H H H H H H H H H H H H H H H H H H H H H H
charge: 0
multiplicity: 1
keywords: wb97x-d3
keywords: def2-TZVPP
keywords: def2/J RIJCOSX
keywords: DEFGRID2
keywords: scfconv7
keywords: smallprint printgap noloewdin
keywords: NOSOSCF
formula: C24H25NO3
InChI: InChI=1/C24H25NO3/c1-16(2)13-20-22(24(20,3)4)23(26)28-21(15-25)17-9-8-12-19(14-17)27-18-10-6-5-7-11-18/h5-14,20-22H,1-4H3
53 atoms
O  -0.575105 1.57937 -0.130893
O  -1.133426 3.520275 0.815126
O  0.002185 -3.318949 -0.77792
N  -2.106605 0.787185 2.785988
C  1.37921 4.525323 -0.847559
C  1.729795 4.375074 0.591285
C  1.054221 3.22185 -0.126574
C  0.27501 5.47392 -1.241751
C  2.469286 4.413707 -1.885524
C  3.132799 4.22811 1.059621
C  -0.314149 2.846671 0.242183
C  3.532497 3.412053 2.038286
C  2.605316 2.50914 2.79301
C  4.970764 3.334362 2.450011
C  -1.849327 1.052272 0.193859
C  -1.969855 -0.305749 -0.451103
C  -1.985358 0.929308 1.652593
C  -0.947272 -1.234645 -0.3002
C  -3.10819 -0.62261 -1.176825
C  -1.062701 -2.477321 -0.901644
C  -3.214187 -1.876305 -1.764031
C  -2.196328 -2.806812 -1.638646
C  -0.205393 -4.669888 -0.674458
C  0.581702 -5.500654 -1.457112
C  -1.126651 -5.196022 0.222666
C  0.446221 -6.876906 -1.337035
C  -1.258757 -6.572979 0.324308
C  -0.476346 -7.417636 -0.45256
H  1.067605 4.908917 1.269707
H  1.687502 2.384072 -0.395243
H  -0.248079 5.120224 -2.132362
H  -0.462312 5.626503 -0.456291
H  0.700664 6.450746 -1.479961
H  2.052929 4.098706 -2.844172
H  2.955164 5.379483 -2.039621
H  3.240035 3.694472 -1.607949
H  3.874863 4.85468 0.571993
H  2.808217 1.460795 2.55686
H  2.758057 2.61542 3.869685
H  1.552809 2.697974 2.589527
H  5.610168 3.972411 1.840003
H  5.097202 3.62951 3.494968
H  5.344001 2.309632 2.372343
H  -2.65244 1.705693 -0.160255
H  -0.05895 -1.003664 0.275868
H  -3.904831 0.101787 -1.289143
H  -4.095399 -2.12808 -2.33895
H  -2.285638 -3.772904 -2.118855
H  1.296269 -5.073196 -2.149319
H  -1.730833 -4.543517 0.841104
H  1.06167 -7.526519 -1.945941
H  -1.975133 -6.985957 1.022667
H  -0.583333 -8.490852 -0.365495
elementType: O N C H
totalener: -1210.10675407 hartree
nucrepener: 2411.21509581 hartree
electener: -3621.32184988 hartree
oneelecener: -6433.98549573 hartree
twoeener: 2812.66364584 hartree
cpcmener: -0.03116835 hartree
kineticenergy: 1204.72163481 hartree
xcener: -118.584244522096 hartree
chargesum: -0.0000000
charge: -0.283321 -0.449900 -0.327633 -0.093498 0.142815 -0.009492 -0.102570 -0.276256 -0.282715 -0.300647 0.383625 -0.009822 -0.238095 -0.227675 0.425350 -0.002845 -0.234164 -0.212642 -0.181802 0.207412 -0.143327 -0.157792 0.247030 -0.228104 -0.167784 -0.130443 -0.150734 -0.172967 0.106286 0.097002 0.100295 0.092820 0.096053 0.098198 0.099325 0.092998 0.121907 0.101850 0.100905 0.080414 0.088471 0.096925 0.093747 0.129227 0.138020 0.146577 0.160457 0.157246 0.146925 0.158070 0.156900 0.159254 0.158127
qa: -0.2833 -0.4499 -0.3276 -0.0935 0.1428 -0.0095 -0.1026 -0.2763 -0.2827 -0.3006 0.3836 -0.0098 -0.2381 -0.2277 0.4253 -0.0028 -0.2342 -0.2126 -0.1818 0.2074 -0.1433 -0.1578 0.2470 -0.2281 -0.1678 -0.1304 -0.1507 -0.1730 0.1063 0.0970 0.1003 0.0928 0.0961 0.0982 0.0993 0.0930 0.1219 0.1019 0.1009 0.0804 0.0885 0.0969 0.0937 0.1292 0.1380 0.1466 0.1605 0.1572 0.1469 0.1581 0.1569 0.1593 0.1581
va: 2.1485 2.0542 2.0708 3.1079 3.7085 3.8106 3.8301 3.8956 3.9084 3.8963 4.1473 3.7073 3.9360 3.9324 3.7291 3.7522 4.0124 4.0690 3.9519 3.8289 3.9189 3.8994 3.7143 3.9993 3.9044 3.8920 3.8935 3.8946 1.0242 1.0259 0.9990 1.0162 1.0010 1.0031 1.0001 1.0023 1.0040 0.9981 1.0004 1.0137 1.0064 0.9963 0.9965 1.0216 1.0281 1.0026 0.9914 0.9951 1.0069 0.9960 0.9897 0.9905 0.9902
dispcorr: -0.024705419 hartree
energy: -1210.131459492377
dipole: 21.89108 -21.33514 0.55594 20.29586 -21.13429 -0.83843 -0.85612 -1.39252 -2.24864
magnitude: 2.46341 au
magnitude: 6.26150 debye
